Skip to content

Progress 2/7 #1479

Progress 2/7

Progress 2/7 #1479

Triggered via push February 8, 2024 21:22
Status Cancelled
Total duration 3m 42s
Artifacts

main.yml

on: push
Windows (JDK 8)
3m 17s
Windows (JDK 8)
Windows (JDK 17)
3m 20s
Windows (JDK 17)
Linux (JDK 8), oldest Guava, America/New_York Timezone
3m 15s
Linux (JDK 8), oldest Guava, America/New_York Timezone
Linux (JDK 8), latest Guava, America/New_York Timezone
3m 12s
Linux (JDK 8), latest Guava, America/New_York Timezone
Linux (JDK 11), Pacific/Chatham Timezone
3m 13s
Linux (JDK 11), Pacific/Chatham Timezone
Linux (JDK 17)
3m 14s
Linux (JDK 17)
Linux (JDK 19)
3m 17s
Linux (JDK 19)
Linux (JDK 11), Avatica main
3m 30s
Linux (JDK 11), Avatica main
macOS (JDK 19)
3m 17s
macOS (JDK 19)
Error Prone (JDK 11), latest Guava
2m 53s
Error Prone (JDK 11), latest Guava
CheckerFramework (JDK 11)
3m 22s
CheckerFramework (JDK 11)
CheckerFramework (JDK 11), oldest Guava
3m 21s
CheckerFramework (JDK 11), oldest Guava
Linux (JDK 8) Slow Tests
0s
Linux (JDK 8) Slow Tests
Druid Tests
3m 13s
Druid Tests
Fit to window
Zoom out
Zoom in

Annotations

33 errors and 27 warnings
Error Prone (JDK 11), latest Guava: task ':core:compileJava'#L1
Execution failed for task ':core:compileJava': org.gradle.api.internal.tasks.compile.CompilationFailedException: Compilation failed; see the compiler error output for details. at org.gradle.api.internal.tasks.compile.JdkJavaCompiler.execute(JdkJavaCompiler.java:58) at org.gradle.api.internal.tasks.compile.JdkJavaCompiler.execute(JdkJavaCompiler.java:41) at org.gradle.api.internal.tasks.compile.NormalizingJavaCompiler.delegateAndHandleErrors(NormalizingJavaCompiler.java:98) at org.gradle.api.internal.tasks.compile.NormalizingJavaCompiler.execute(NormalizingJavaCompiler.java:52) at org.gradle.api.internal.tasks.compile.NormalizingJavaCompiler.execute(NormalizingJavaCompiler.java:38) at org.gradle.api.internal.tasks.compile.AnnotationProcessorDiscoveringCompiler.execute(AnnotationProcessorDiscoveringCompiler.java:51) at org.gradle.api.internal.tasks.compile.AnnotationProcessorDiscoveringCompiler.execute(AnnotationProcessorDiscoveringCompiler.java:37) at org.gradle.api.internal.tasks.compile.ModuleApplicationNameWritingCompiler.execute(ModuleApplicationNameWritingCompiler.java:46) at org.gradle.api.internal.tasks.compile.ModuleApplicationNameWritingCompiler.execute(ModuleApplicationNameWritingCompiler.java:36) at org.gradle.jvm.toolchain.internal.DefaultToolchainJavaCompiler.execute(DefaultToolchainJavaCompiler.java:57) at org.gradle.api.tasks.compile.JavaCompile.lambda$createToolchainCompiler$1(JavaCompile.java:237) at org.gradle.api.internal.tasks.compile.CleaningJavaCompiler.execute(CleaningJavaCompiler.java:53) at org.gradle.api.internal.tasks.compile.incremental.IncrementalCompilerFactory.lambda$createRebuildAllCompiler$0(IncrementalCompilerFactory.java:52) at org.gradle.api.internal.tasks.compile.incremental.SelectiveCompiler.execute(SelectiveCompiler.java:70) at org.gradle.api.internal.tasks.compile.incremental.SelectiveCompiler.execute(SelectiveCompiler.java:44) at org.gradle.api.internal.tasks.compile.incremental.IncrementalResultStoringCompiler.execute(IncrementalResultStoringCompiler.java:66) at org.gradle.api.internal.tasks.compile.incremental.IncrementalResultStoringCompiler.execute(IncrementalResultStoringCompiler.java:52) at org.gradle.api.internal.tasks.compile.CompileJavaBuildOperationReportingCompiler$2.call(CompileJavaBuildOperationReportingCompiler.java:59) at org.gradle.api.internal.tasks.compile.CompileJavaBuildOperationReportingCompiler$2.call(CompileJavaBuildOperationReportingCompiler.java:51) at org.gradle.internal.operations.DefaultBuildOperationRunner$CallableBuildOperationWorker.execute(DefaultBuildOperationRunner.java:204) at org.gradle.internal.operations.DefaultBuildOperationRunner$CallableBuildOperationWorker.execute(DefaultBuildOperationRunner.java:199) at org.gradle.internal.operations.DefaultBuildOperationRunner$2.execute(DefaultBuildOperationRunner.java:66) at org.gradle.internal.operations.DefaultBuildOperationRunner$2.execute(DefaultBuildOperationRunner.java:59) at org.gradle.internal.operations.DefaultBuildOperationRunner.execute(DefaultBuildOperationRunner.java:157) at org.gradle.internal.operations.DefaultBuildOperationRunner.execute(DefaultBuildOperationRunner.java:59) at org.gradle.internal.operations.DefaultBuildOperationRunner.call(DefaultBuildOperationRunner.java:53) at org.gradle.internal.operations.DefaultBuildOperationExecutor.call(DefaultBuildOperationExecutor.java:73) at org.gradle.api.internal.tasks.compile.CompileJavaBuildOperationReportingCompiler.execute(CompileJavaBuildOperationReportingCompiler.java:51) at org.gradle.api.tasks.compile.JavaCompile.performCompilation(JavaCompile.java:288) at org.gradle.api.tasks.compile.JavaCompile.performIncrementalCompilation(JavaCompile.java:170) at org.gradle.api.tasks.compile.JavaCompile.compile(JavaCompile.java:148) at org.gradle.internal.reflect.JavaMethod.invoke(JavaMethod.j
Error Prone (JDK 11), latest Guava
Execution failed for task ':core:compileJava'. > Compilation failed; see the compiler error output for details.
Linux (JDK 11), Pacific/Chatham Timezone: BabelTest.java#L105
1.7sec org.apache.calcite.test.BabelTest > testInfixCast() java.sql.SQLException: Error while executing SQL "SELECT x::integer FROM (VALUES ('1', '2')) as tbl(x, y)": mustFilterFields (maybe validation is not complete?) at org.apache.calcite.avatica.Helper.createException(Helper.java:56) at org.apache.calcite.avatica.Helper.createException(Helper.java:41) at org.apache.calcite.avatica.AvaticaStatement.executeInternal(AvaticaStatement.java:164) at org.apache.calcite.avatica.AvaticaStatement.executeQuery(AvaticaStatement.java:228) at org.apache.calcite.test.BabelTest.checkInfixCast(BabelTest.java:105) at org.apache.calcite.test.BabelTest.testInfixCast(BabelTest.java:93) Next exception 1: [CIRCULAR REFERENCE SQLException] Next exception 2: java.lang.NullPointerException: mustFilterFields (maybe validation is not complete?) at java.base/java.util.Objects.requireNonNull(Objects.java:248) at org.apache.calcite.sql.validate.AbstractNamespace.getMustFilterFields(AbstractNamespace.java:171) at org.apache.calcite.sql.validate.AliasNamespace.getMustFilterFields(AliasNamespace.java:48) at org.apache.calcite.sql.validate.SqlValidatorImpl.validateSelect(SqlValidatorImpl.java:3896) at org.apache.calcite.sql.validate.SelectNamespace.validateImpl(SelectNamespace.java:64) at org.apache.calcite.sql.validate.AbstractNamespace.validate(AbstractNamespace.java:95) at org.apache.calcite.sql.validate.SqlValidatorImpl.validateNamespace(SqlValidatorImpl.java:1164) at org.apache.calcite.sql.validate.SqlValidatorImpl.validateQuery(SqlValidatorImpl.java:1135) at org.apache.calcite.sql.SqlSelect.validate(SqlSelect.java:284) at org.apache.calcite.sql.validate.SqlValidatorImpl.validateScopedExpression(SqlValidatorImpl.java:1101) at org.apache.calcite.sql.validate.SqlValidatorImpl.validate(SqlValidatorImpl.java:807) at org.apache.calcite.sql2rel.SqlToRelConverter.convertQuery(SqlToRelConverter.java:610) at org.apache.calcite.prepare.Prepare.prepareSql(Prepare.java:257) at org.apache.calcite.prepare.Prepare.prepareSql(Prepare.java:220) at org.apache.calcite.prepare.CalcitePrepareImpl.prepare2_(CalcitePrepareImpl.java:666) at org.apache.calcite.prepare.CalcitePrepareImpl.prepare_(CalcitePrepareImpl.java:519) at org.apache.calcite.prepare.CalcitePrepareImpl.prepareSql(CalcitePrepareImpl.java:487) at org.apache.calcite.jdbc.CalciteConnectionImpl.parseQuery(CalciteConnectionImpl.java:236) at org.apache.calcite.jdbc.CalciteMetaImpl.prepareAndExecute(CalciteMetaImpl.java:702) at org.apache.calcite.avatica.AvaticaConnection.prepareAndExecuteInternal(AvaticaConnection.java:677) at org.apache.calcite.avatica.AvaticaStatement.executeInternal(AvaticaStatement.java:157) ... 3 more Caused by: [CIRCULAR REFERENCE NullPointerException]
Linux (JDK 11), Pacific/Chatham Timezone: BabelTest.java#L278
2.7sec org.apache.calcite.test.BabelTest > testNullSafeEqual() java.sql.SQLException: Error while executing SQL "SELECT x <=> 1 + 3 FROM (VALUES (1, 2)) as tbl(x,y)": mustFilterFields (maybe validation is not complete?) at org.apache.calcite.avatica.Helper.createException(Helper.java:56) at org.apache.calcite.avatica.Helper.createException(Helper.java:41) at org.apache.calcite.avatica.AvaticaStatement.executeInternal(AvaticaStatement.java:164) at org.apache.calcite.avatica.AvaticaStatement.executeQuery(AvaticaStatement.java:228) at org.apache.calcite.test.CalciteAssert.assertQuery(CalciteAssert.java:566) at org.apache.calcite.test.CalciteAssert$AssertQuery.lambda$returns$1(CalciteAssert.java:1495) at org.apache.calcite.test.CalciteAssert$AssertQuery.withConnection(CalciteAssert.java:1434) at org.apache.calcite.test.CalciteAssert$AssertQuery.returns(CalciteAssert.java:1493) at org.apache.calcite.test.CalciteAssert$AssertQuery.returns(CalciteAssert.java:1483) at org.apache.calcite.test.CalciteAssert$AssertQuery.returns(CalciteAssert.java:1446) at org.apache.calcite.test.BabelTest.checkSqlResult(BabelTest.java:278) at org.apache.calcite.test.BabelTest.testNullSafeEqual(BabelTest.java:226) Suppressed: org.apache.calcite.util.TestUtil$ExtraInformation: With materializationsEnabled=false, limit=-1 at app//org.apache.calcite.util.TestUtil.rethrow(TestUtil.java:389) at app//org.apache.calcite.test.CalciteAssert.assertQuery(CalciteAssert.java:598) ... 7 more Next exception 1: [CIRCULAR REFERENCE SQLException] Next exception 2: java.lang.NullPointerException: mustFilterFields (maybe validation is not complete?) at java.base/java.util.Objects.requireNonNull(Objects.java:248) at org.apache.calcite.sql.validate.AbstractNamespace.getMustFilterFields(AbstractNamespace.java:171) at org.apache.calcite.sql.validate.AliasNamespace.getMustFilterFields(AliasNamespace.java:48) at org.apache.calcite.sql.validate.SqlValidatorImpl.validateSelect(SqlValidatorImpl.java:3896) at org.apache.calcite.sql.validate.SelectNamespace.validateImpl(SelectNamespace.java:64) at org.apache.calcite.sql.validate.AbstractNamespace.validate(AbstractNamespace.java:95) at org.apache.calcite.sql.validate.SqlValidatorImpl.validateNamespace(SqlValidatorImpl.java:1164) at org.apache.calcite.sql.validate.SqlValidatorImpl.validateQuery(SqlValidatorImpl.java:1135) at org.apache.calcite.sql.SqlSelect.validate(SqlSelect.java:284) at org.apache.calcite.sql.validate.SqlValidatorImpl.validateScopedExpression(SqlValidatorImpl.java:1101) at org.apache.calcite.sql.validate.SqlValidatorImpl.validate(SqlValidatorImpl.java:807) at org.apache.calcite.sql2rel.SqlToRelConverter.convertQuery(SqlToRelConverter.java:610) at org.apache.calcite.prepare.Prepare.prepareSql(Prepare.java:257) at org.apache.calcite.prepare.Prepare.prepareSql(Prepare.java:220) at org.apache.calcite.prepare.CalcitePrepareImpl.prepare2_(CalcitePrepareImpl.java:666) at org.apache.calcite.prepare.CalcitePrepareImpl.prepare_(CalcitePrepareImpl.java:519) at org.apache.calcite.prepare.CalcitePrepareImpl.prepareSql(CalcitePrepareImpl.java:487) at org.apache.calcite.jdbc.CalciteConnectionImpl.parseQuery(CalciteConnectionImpl.java:236) at org.apache.calcite.jdbc.CalciteMetaImpl.prepareAndExecute(CalciteMetaImpl.java:702) at org.apache.calcite.avatica.AvaticaConnection.prepareAndExecuteInternal(AvaticaConnection.java:677) at org.apache.calcite.avatica.AvaticaStatement.executeInternal(AvaticaStatement.java:157) ... 9 more Caused by: [CIRCULAR REFERENCE NullPointerException]
Linux (JDK 11), Pacific/Chatham Timezone: org.apache.calcite.test.BabelQuidemTest > test(String)[2%5D#L1
4.1sec org.apache.calcite.test.BabelQuidemTest > test(String)[2], [2] sql/big-query.iq org.opentest4j.AssertionFailedError: Files differ: /home/runner/work/calcite/calcite/babel/build/quidem/test/sql/big-query.iq /home/runner/work/calcite/calcite/babel/build/resources/test/sql/big-query.iq 1016,1024c1016,1164 < +-----------------+----------+ < | email | is_valid | < +-----------------+----------+ < | bar@example.org | true | < | foo@example.com | true | < | www.example.net | false | < +-----------------+----------+ < (3 rows) < --- > java.sql.SQLException: Error while executing SQL "SELECT > email, > REGEXP_CONTAINS(email, '@[a-zA-Z0-9-]+\.[a-zA-Z0-9-.]+') AS is_valid > FROM > (SELECT > ARRAY['foo@example.com', 'bar@example.org', 'www.example.net'] > AS addresses), > UNNEST(addresses) AS email": mustFilterFields (maybe validation is not complete?) > at org.apache.calcite.avatica.Helper.createException(Helper.java:56) > at org.apache.calcite.avatica.Helper.createException(Helper.java:41) > at org.apache.calcite.avatica.AvaticaStatement.executeInternal(AvaticaStatement.java:164) > at org.apache.calcite.avatica.AvaticaStatement.executeQuery(AvaticaStatement.java:228) > at net.hydromatic.quidem.Quidem.checkResult(Quidem.java:299) > at net.hydromatic.quidem.Quidem.access$2600(Quidem.java:57) > at net.hydromatic.quidem.Quidem$ContextImpl.checkResult(Quidem.java:1636) > at net.hydromatic.quidem.Quidem$CheckResultCommand.execute(Quidem.java:941) > at net.hydromatic.quidem.Quidem$CompositeCommand.execute(Quidem.java:1437) > at net.hydromatic.quidem.Quidem.execute(Quidem.java:190) > at org.apache.calcite.test.QuidemTest.checkRun(QuidemTest.java:178) > at org.apache.calcite.test.QuidemTest.test(QuidemTest.java:239) > at java.base/jdk.internal.reflect.NativeMethodAccessorImpl.invoke0(Native Method) > at java.base/jdk.internal.reflect.NativeMethodAccessorImpl.invoke(NativeMethodAccessorImpl.java:62) > at java.base/jdk.internal.reflect.DelegatingMethodAccessorImpl.invoke(DelegatingMethodAccessorImpl.java:43) > at java.base/java.lang.reflect.Method.invoke(Method.java:566) > at org.junit.platform.commons.util.ReflectionUtils.invokeMethod(ReflectionUtils.java:727) > at org.junit.jupiter.engine.execution.MethodInvocation.proceed(MethodInvocation.java:60) > at org.junit.jupiter.engine.execution.InvocationInterceptorChain$ValidatingInvocation.proceed(InvocationInterceptorChain.java:131) > at org.junit.jupiter.engine.extension.SameThreadTimeoutInvocation.proceed(SameThreadTimeoutInvocation.java:45) > at org.junit.jupiter.engine.extension.TimeoutExtension.intercept(TimeoutExtension.java:156) > at org.junit.jupiter.engine.extension.TimeoutExtension.interceptTestableMethod(TimeoutExtension.java:147) > at org.junit.jupiter.engine.extension.TimeoutExtension.interceptTestTemplateMethod(TimeoutExtension.java:94) > at org.junit.jupiter.engine.execution.InterceptingExecutableInvoker$ReflectiveInterceptorCall.lambda$ofVoidMethod$0(InterceptingExecutableInvoker.java:103) > at org.junit.jupiter.engine.execution.InterceptingExecutableInvoker.lambda$invoke$0(InterceptingExecutableInvoker.java:93) > at org.junit.jupiter.engine.execution.InvocationInterceptorChain$InterceptedInvocation.proceed(InvocationInterceptorChain.java:106) > at org.junit.jupiter.engine.execution.InvocationInterceptorChain.proceed(InvocationInterceptorChain.java:64) > at org.junit.jupiter.engine.execution.InvocationInterceptorChain.chainAndInvoke(InvocationInterceptorChain.java:45) > at org.junit.jupiter.engine.execution.InvocationInterceptorChain.invoke(InvocationInterceptorChain.java:37) > at org.junit.jupiter.engine.execution.InterceptingExecutableInvoker.invoke(InterceptingExecutableInvoker.java:92) > at org.junit.jupiter.engine.execution.InterceptingExecutableInvoker.invoke(InterceptingExecutableInvoker.java:86) > at org.junit.jupiter.engine.descriptor.TestMethodTestDescriptor.lambda$invokeTestMethod$7(TestMethodTestDescriptor.java:217) > at org.junit.platform.engine.support.hierarchical.ThrowableCollector.e
Linux (JDK 11), Pacific/Chatham Timezone: task ':babel:test'#L1
Execution failed for task ':babel:test': org.gradle.api.tasks.VerificationException: There were failing tests. See the report at: file:///home/runner/work/calcite/calcite/babel/build/reports/tests/test/index.html
Linux (JDK 11), Pacific/Chatham Timezone
Execution failed for task ':babel:test'. > There were failing tests. See the report at: file:///home/runner/work/calcite/calcite/babel/build/reports/tests/test/index.html
Druid Tests
The operation was canceled.
Linux (JDK 8), latest Guava, America/New_York Timezone: BabelTest.java#L105
1.6sec org.apache.calcite.test.BabelTest > testInfixCast() java.sql.SQLException: Error while executing SQL "SELECT x::integer FROM (VALUES ('1', '2')) as tbl(x, y)": mustFilterFields (maybe validation is not complete?) at org.apache.calcite.avatica.Helper.createException(Helper.java:56) at org.apache.calcite.avatica.Helper.createException(Helper.java:41) at org.apache.calcite.avatica.AvaticaStatement.executeInternal(AvaticaStatement.java:164) at org.apache.calcite.avatica.AvaticaStatement.executeQuery(AvaticaStatement.java:228) at org.apache.calcite.test.BabelTest.checkInfixCast(BabelTest.java:105) at org.apache.calcite.test.BabelTest.testInfixCast(BabelTest.java:93) Next exception 1: [CIRCULAR REFERENCE SQLException] Next exception 2: java.lang.NullPointerException: mustFilterFields (maybe validation is not complete?) at java.util.Objects.requireNonNull(Objects.java:228) at org.apache.calcite.sql.validate.AbstractNamespace.getMustFilterFields(AbstractNamespace.java:171) at org.apache.calcite.sql.validate.AliasNamespace.getMustFilterFields(AliasNamespace.java:48) at org.apache.calcite.sql.validate.SqlValidatorImpl.validateSelect(SqlValidatorImpl.java:3896) at org.apache.calcite.sql.validate.SelectNamespace.validateImpl(SelectNamespace.java:64) at org.apache.calcite.sql.validate.AbstractNamespace.validate(AbstractNamespace.java:95) at org.apache.calcite.sql.validate.SqlValidatorImpl.validateNamespace(SqlValidatorImpl.java:1164) at org.apache.calcite.sql.validate.SqlValidatorImpl.validateQuery(SqlValidatorImpl.java:1135) at org.apache.calcite.sql.SqlSelect.validate(SqlSelect.java:284) at org.apache.calcite.sql.validate.SqlValidatorImpl.validateScopedExpression(SqlValidatorImpl.java:1101) at org.apache.calcite.sql.validate.SqlValidatorImpl.validate(SqlValidatorImpl.java:807) at org.apache.calcite.sql2rel.SqlToRelConverter.convertQuery(SqlToRelConverter.java:610) at org.apache.calcite.prepare.Prepare.prepareSql(Prepare.java:257) at org.apache.calcite.prepare.Prepare.prepareSql(Prepare.java:220) at org.apache.calcite.prepare.CalcitePrepareImpl.prepare2_(CalcitePrepareImpl.java:666) at org.apache.calcite.prepare.CalcitePrepareImpl.prepare_(CalcitePrepareImpl.java:519) at org.apache.calcite.prepare.CalcitePrepareImpl.prepareSql(CalcitePrepareImpl.java:487) at org.apache.calcite.jdbc.CalciteConnectionImpl.parseQuery(CalciteConnectionImpl.java:236) at org.apache.calcite.jdbc.CalciteMetaImpl.prepareAndExecute(CalciteMetaImpl.java:702) at org.apache.calcite.avatica.AvaticaConnection.prepareAndExecuteInternal(AvaticaConnection.java:677) at org.apache.calcite.avatica.AvaticaStatement.executeInternal(AvaticaStatement.java:157) ... 3 more Caused by: [CIRCULAR REFERENCE NullPointerException]
Linux (JDK 8), latest Guava, America/New_York Timezone: BabelTest.java#L278
2.7sec org.apache.calcite.test.BabelTest > testNullSafeEqual() java.sql.SQLException: Error while executing SQL "SELECT x <=> 1 + 3 FROM (VALUES (1, 2)) as tbl(x,y)": mustFilterFields (maybe validation is not complete?) at org.apache.calcite.avatica.Helper.createException(Helper.java:56) at org.apache.calcite.avatica.Helper.createException(Helper.java:41) at org.apache.calcite.avatica.AvaticaStatement.executeInternal(AvaticaStatement.java:164) at org.apache.calcite.avatica.AvaticaStatement.executeQuery(AvaticaStatement.java:228) at org.apache.calcite.test.CalciteAssert.assertQuery(CalciteAssert.java:566) at org.apache.calcite.test.CalciteAssert$AssertQuery.lambda$returns$1(CalciteAssert.java:1495) at org.apache.calcite.test.CalciteAssert$AssertQuery.withConnection(CalciteAssert.java:1434) at org.apache.calcite.test.CalciteAssert$AssertQuery.returns(CalciteAssert.java:1493) at org.apache.calcite.test.CalciteAssert$AssertQuery.returns(CalciteAssert.java:1483) at org.apache.calcite.test.CalciteAssert$AssertQuery.returns(CalciteAssert.java:1446) at org.apache.calcite.test.BabelTest.checkSqlResult(BabelTest.java:278) at org.apache.calcite.test.BabelTest.testNullSafeEqual(BabelTest.java:226) Suppressed: org.apache.calcite.util.TestUtil$ExtraInformation: With materializationsEnabled=false, limit=-1 at org.apache.calcite.util.TestUtil.rethrow(TestUtil.java:389) at org.apache.calcite.test.CalciteAssert.assertQuery(CalciteAssert.java:598) ... 7 more Next exception 1: [CIRCULAR REFERENCE SQLException] Next exception 2: java.lang.NullPointerException: mustFilterFields (maybe validation is not complete?) at java.util.Objects.requireNonNull(Objects.java:228) at org.apache.calcite.sql.validate.AbstractNamespace.getMustFilterFields(AbstractNamespace.java:171) at org.apache.calcite.sql.validate.AliasNamespace.getMustFilterFields(AliasNamespace.java:48) at org.apache.calcite.sql.validate.SqlValidatorImpl.validateSelect(SqlValidatorImpl.java:3896) at org.apache.calcite.sql.validate.SelectNamespace.validateImpl(SelectNamespace.java:64) at org.apache.calcite.sql.validate.AbstractNamespace.validate(AbstractNamespace.java:95) at org.apache.calcite.sql.validate.SqlValidatorImpl.validateNamespace(SqlValidatorImpl.java:1164) at org.apache.calcite.sql.validate.SqlValidatorImpl.validateQuery(SqlValidatorImpl.java:1135) at org.apache.calcite.sql.SqlSelect.validate(SqlSelect.java:284) at org.apache.calcite.sql.validate.SqlValidatorImpl.validateScopedExpression(SqlValidatorImpl.java:1101) at org.apache.calcite.sql.validate.SqlValidatorImpl.validate(SqlValidatorImpl.java:807) at org.apache.calcite.sql2rel.SqlToRelConverter.convertQuery(SqlToRelConverter.java:610) at org.apache.calcite.prepare.Prepare.prepareSql(Prepare.java:257) at org.apache.calcite.prepare.Prepare.prepareSql(Prepare.java:220) at org.apache.calcite.prepare.CalcitePrepareImpl.prepare2_(CalcitePrepareImpl.java:666) at org.apache.calcite.prepare.CalcitePrepareImpl.prepare_(CalcitePrepareImpl.java:519) at org.apache.calcite.prepare.CalcitePrepareImpl.prepareSql(CalcitePrepareImpl.java:487) at org.apache.calcite.jdbc.CalciteConnectionImpl.parseQuery(CalciteConnectionImpl.java:236) at org.apache.calcite.jdbc.CalciteMetaImpl.prepareAndExecute(CalciteMetaImpl.java:702) at org.apache.calcite.avatica.AvaticaConnection.prepareAndExecuteInternal(AvaticaConnection.java:677) at org.apache.calcite.avatica.AvaticaStatement.executeInternal(AvaticaStatement.java:157) ... 9 more Caused by: [CIRCULAR REFERENCE NullPointerException]
Linux (JDK 8), latest Guava, America/New_York Timezone: org.apache.calcite.test.BabelQuidemTest > test(String)[2%5D#L1
4.1sec org.apache.calcite.test.BabelQuidemTest > test(String)[2], [2] sql/big-query.iq org.opentest4j.AssertionFailedError: Files differ: /home/runner/work/calcite/calcite/babel/build/quidem/test/sql/big-query.iq /home/runner/work/calcite/calcite/babel/build/resources/test/sql/big-query.iq 1016,1024c1016,1163 < +-----------------+----------+ < | email | is_valid | < +-----------------+----------+ < | bar@example.org | true | < | foo@example.com | true | < | www.example.net | false | < +-----------------+----------+ < (3 rows) < --- > java.sql.SQLException: Error while executing SQL "SELECT > email, > REGEXP_CONTAINS(email, '@[a-zA-Z0-9-]+\.[a-zA-Z0-9-.]+') AS is_valid > FROM > (SELECT > ARRAY['foo@example.com', 'bar@example.org', 'www.example.net'] > AS addresses), > UNNEST(addresses) AS email": mustFilterFields (maybe validation is not complete?) > at org.apache.calcite.avatica.Helper.createException(Helper.java:56) > at org.apache.calcite.avatica.Helper.createException(Helper.java:41) > at org.apache.calcite.avatica.AvaticaStatement.executeInternal(AvaticaStatement.java:164) > at org.apache.calcite.avatica.AvaticaStatement.executeQuery(AvaticaStatement.java:228) > at net.hydromatic.quidem.Quidem.checkResult(Quidem.java:299) > at net.hydromatic.quidem.Quidem.access$2600(Quidem.java:57) > at net.hydromatic.quidem.Quidem$ContextImpl.checkResult(Quidem.java:1636) > at net.hydromatic.quidem.Quidem$CheckResultCommand.execute(Quidem.java:941) > at net.hydromatic.quidem.Quidem$CompositeCommand.execute(Quidem.java:1437) > at net.hydromatic.quidem.Quidem.execute(Quidem.java:190) > at org.apache.calcite.test.QuidemTest.checkRun(QuidemTest.java:178) > at org.apache.calcite.test.QuidemTest.test(QuidemTest.java:239) > at sun.reflect.NativeMethodAccessorImpl.invoke0(Native Method) > at sun.reflect.NativeMethodAccessorImpl.invoke(NativeMethodAccessorImpl.java:62) > at sun.reflect.DelegatingMethodAccessorImpl.invoke(DelegatingMethodAccessorImpl.java:43) > at java.lang.reflect.Method.invoke(Method.java:498) > at org.junit.platform.commons.util.ReflectionUtils.invokeMethod(ReflectionUtils.java:727) > at org.junit.jupiter.engine.execution.MethodInvocation.proceed(MethodInvocation.java:60) > at org.junit.jupiter.engine.execution.InvocationInterceptorChain$ValidatingInvocation.proceed(InvocationInterceptorChain.java:131) > at org.junit.jupiter.engine.extension.SameThreadTimeoutInvocation.proceed(SameThreadTimeoutInvocation.java:45) > at org.junit.jupiter.engine.extension.TimeoutExtension.intercept(TimeoutExtension.java:156) > at org.junit.jupiter.engine.extension.TimeoutExtension.interceptTestableMethod(TimeoutExtension.java:147) > at org.junit.jupiter.engine.extension.TimeoutExtension.interceptTestTemplateMethod(TimeoutExtension.java:94) > at org.junit.jupiter.engine.execution.InterceptingExecutableInvoker$ReflectiveInterceptorCall.lambda$ofVoidMethod$0(InterceptingExecutableInvoker.java:103) > at org.junit.jupiter.engine.execution.InterceptingExecutableInvoker.lambda$invoke$0(InterceptingExecutableInvoker.java:93) > at org.junit.jupiter.engine.execution.InvocationInterceptorChain$InterceptedInvocation.proceed(InvocationInterceptorChain.java:106) > at org.junit.jupiter.engine.execution.InvocationInterceptorChain.proceed(InvocationInterceptorChain.java:64) > at org.junit.jupiter.engine.execution.InvocationInterceptorChain.chainAndInvoke(InvocationInterceptorChain.java:45) > at org.junit.jupiter.engine.execution.InvocationInterceptorChain.invoke(InvocationInterceptorChain.java:37) > at org.junit.jupiter.engine.execution.InterceptingExecutableInvoker.invoke(InterceptingExecutableInvoker.java:92) > at org.junit.jupiter.engine.execution.InterceptingExecutableInvoker.invoke(InterceptingExecutableInvoker.java:86) > at org.junit.jupiter.engine.descriptor.TestMethodTestDescriptor.lambda$invokeTestMethod$7(TestMethodTestDescriptor.java:217) > at org.junit.platform.engine.support.hierarchical.ThrowableCollector.execute(ThrowableCollector.java:73) > at org.junit.jupiter.engine.d
Linux (JDK 8), latest Guava, America/New_York Timezone: task ':babel:test'#L1
Execution failed for task ':babel:test': org.gradle.api.tasks.VerificationException: There were failing tests. See the report at: file:///home/runner/work/calcite/calcite/babel/build/reports/tests/test/index.html
Linux (JDK 8), latest Guava, America/New_York Timezone
Execution failed for task ':babel:test'. > There were failing tests. See the report at: file:///home/runner/work/calcite/calcite/babel/build/reports/tests/test/index.html
Linux (JDK 17): BabelTest.java#L105
1.4sec org.apache.calcite.test.BabelTest > testInfixCast() java.sql.SQLException: Error while executing SQL "SELECT x::integer FROM (VALUES ('1', '2')) as tbl(x, y)": mustFilterFields (maybe validation is not complete?) at org.apache.calcite.avatica.Helper.createException(Helper.java:56) at org.apache.calcite.avatica.Helper.createException(Helper.java:41) at org.apache.calcite.avatica.AvaticaStatement.executeInternal(AvaticaStatement.java:164) at org.apache.calcite.avatica.AvaticaStatement.executeQuery(AvaticaStatement.java:228) at org.apache.calcite.test.BabelTest.checkInfixCast(BabelTest.java:105) at org.apache.calcite.test.BabelTest.testInfixCast(BabelTest.java:93) Next exception 1: [CIRCULAR REFERENCE SQLException] Next exception 2: java.lang.NullPointerException: mustFilterFields (maybe validation is not complete?) at java.base/java.util.Objects.requireNonNull(Objects.java:235) at org.apache.calcite.sql.validate.AbstractNamespace.getMustFilterFields(AbstractNamespace.java:171) at org.apache.calcite.sql.validate.AliasNamespace.getMustFilterFields(AliasNamespace.java:48) at org.apache.calcite.sql.validate.SqlValidatorImpl.validateSelect(SqlValidatorImpl.java:3896) at org.apache.calcite.sql.validate.SelectNamespace.validateImpl(SelectNamespace.java:64) at org.apache.calcite.sql.validate.AbstractNamespace.validate(AbstractNamespace.java:95) at org.apache.calcite.sql.validate.SqlValidatorImpl.validateNamespace(SqlValidatorImpl.java:1164) at org.apache.calcite.sql.validate.SqlValidatorImpl.validateQuery(SqlValidatorImpl.java:1135) at org.apache.calcite.sql.SqlSelect.validate(SqlSelect.java:284) at org.apache.calcite.sql.validate.SqlValidatorImpl.validateScopedExpression(SqlValidatorImpl.java:1101) at org.apache.calcite.sql.validate.SqlValidatorImpl.validate(SqlValidatorImpl.java:807) at org.apache.calcite.sql2rel.SqlToRelConverter.convertQuery(SqlToRelConverter.java:610) at org.apache.calcite.prepare.Prepare.prepareSql(Prepare.java:257) at org.apache.calcite.prepare.Prepare.prepareSql(Prepare.java:220) at org.apache.calcite.prepare.CalcitePrepareImpl.prepare2_(CalcitePrepareImpl.java:666) at org.apache.calcite.prepare.CalcitePrepareImpl.prepare_(CalcitePrepareImpl.java:519) at org.apache.calcite.prepare.CalcitePrepareImpl.prepareSql(CalcitePrepareImpl.java:487) at org.apache.calcite.jdbc.CalciteConnectionImpl.parseQuery(CalciteConnectionImpl.java:236) at org.apache.calcite.jdbc.CalciteMetaImpl.prepareAndExecute(CalciteMetaImpl.java:702) at org.apache.calcite.avatica.AvaticaConnection.prepareAndExecuteInternal(AvaticaConnection.java:677) at org.apache.calcite.avatica.AvaticaStatement.executeInternal(AvaticaStatement.java:157) ... 3 more Caused by: [CIRCULAR REFERENCE NullPointerException]
Linux (JDK 17): BabelTest.java#L278
2.2sec org.apache.calcite.test.BabelTest > testNullSafeEqual() java.sql.SQLException: Error while executing SQL "SELECT x <=> 1 + 3 FROM (VALUES (1, 2)) as tbl(x,y)": mustFilterFields (maybe validation is not complete?) at org.apache.calcite.avatica.Helper.createException(Helper.java:56) at org.apache.calcite.avatica.Helper.createException(Helper.java:41) at org.apache.calcite.avatica.AvaticaStatement.executeInternal(AvaticaStatement.java:164) at org.apache.calcite.avatica.AvaticaStatement.executeQuery(AvaticaStatement.java:228) at org.apache.calcite.test.CalciteAssert.assertQuery(CalciteAssert.java:566) at org.apache.calcite.test.CalciteAssert$AssertQuery.lambda$returns$1(CalciteAssert.java:1495) at org.apache.calcite.test.CalciteAssert$AssertQuery.withConnection(CalciteAssert.java:1434) at org.apache.calcite.test.CalciteAssert$AssertQuery.returns(CalciteAssert.java:1493) at org.apache.calcite.test.CalciteAssert$AssertQuery.returns(CalciteAssert.java:1483) at org.apache.calcite.test.CalciteAssert$AssertQuery.returns(CalciteAssert.java:1446) at org.apache.calcite.test.BabelTest.checkSqlResult(BabelTest.java:278) at org.apache.calcite.test.BabelTest.testNullSafeEqual(BabelTest.java:226) Suppressed: org.apache.calcite.util.TestUtil$ExtraInformation: With materializationsEnabled=false, limit=-1 at app//org.apache.calcite.util.TestUtil.rethrow(TestUtil.java:389) at app//org.apache.calcite.test.CalciteAssert.assertQuery(CalciteAssert.java:598) ... 7 more Next exception 1: [CIRCULAR REFERENCE SQLException] Next exception 2: java.lang.NullPointerException: mustFilterFields (maybe validation is not complete?) at java.base/java.util.Objects.requireNonNull(Objects.java:235) at org.apache.calcite.sql.validate.AbstractNamespace.getMustFilterFields(AbstractNamespace.java:171) at org.apache.calcite.sql.validate.AliasNamespace.getMustFilterFields(AliasNamespace.java:48) at org.apache.calcite.sql.validate.SqlValidatorImpl.validateSelect(SqlValidatorImpl.java:3896) at org.apache.calcite.sql.validate.SelectNamespace.validateImpl(SelectNamespace.java:64) at org.apache.calcite.sql.validate.AbstractNamespace.validate(AbstractNamespace.java:95) at org.apache.calcite.sql.validate.SqlValidatorImpl.validateNamespace(SqlValidatorImpl.java:1164) at org.apache.calcite.sql.validate.SqlValidatorImpl.validateQuery(SqlValidatorImpl.java:1135) at org.apache.calcite.sql.SqlSelect.validate(SqlSelect.java:284) at org.apache.calcite.sql.validate.SqlValidatorImpl.validateScopedExpression(SqlValidatorImpl.java:1101) at org.apache.calcite.sql.validate.SqlValidatorImpl.validate(SqlValidatorImpl.java:807) at org.apache.calcite.sql2rel.SqlToRelConverter.convertQuery(SqlToRelConverter.java:610) at org.apache.calcite.prepare.Prepare.prepareSql(Prepare.java:257) at org.apache.calcite.prepare.Prepare.prepareSql(Prepare.java:220) at org.apache.calcite.prepare.CalcitePrepareImpl.prepare2_(CalcitePrepareImpl.java:666) at org.apache.calcite.prepare.CalcitePrepareImpl.prepare_(CalcitePrepareImpl.java:519) at org.apache.calcite.prepare.CalcitePrepareImpl.prepareSql(CalcitePrepareImpl.java:487) at org.apache.calcite.jdbc.CalciteConnectionImpl.parseQuery(CalciteConnectionImpl.java:236) at org.apache.calcite.jdbc.CalciteMetaImpl.prepareAndExecute(CalciteMetaImpl.java:702) at org.apache.calcite.avatica.AvaticaConnection.prepareAndExecuteInternal(AvaticaConnection.java:677) at org.apache.calcite.avatica.AvaticaStatement.executeInternal(AvaticaStatement.java:157) ... 9 more Caused by: [CIRCULAR REFERENCE NullPointerException]
Linux (JDK 17): org.apache.calcite.test.BabelQuidemTest > test(String)[2%5D#L1
4.2sec org.apache.calcite.test.BabelQuidemTest > test(String)[2], [2] sql/big-query.iq org.opentest4j.AssertionFailedError: Files differ: /home/runner/work/calcite/calcite/babel/build/quidem/test/sql/big-query.iq /home/runner/work/calcite/calcite/babel/build/resources/test/sql/big-query.iq 1016,1024c1016,1164 < +-----------------+----------+ < | email | is_valid | < +-----------------+----------+ < | bar@example.org | true | < | foo@example.com | true | < | www.example.net | false | < +-----------------+----------+ < (3 rows) < --- > java.sql.SQLException: Error while executing SQL "SELECT > email, > REGEXP_CONTAINS(email, '@[a-zA-Z0-9-]+\.[a-zA-Z0-9-.]+') AS is_valid > FROM > (SELECT > ARRAY['foo@example.com', 'bar@example.org', 'www.example.net'] > AS addresses), > UNNEST(addresses) AS email": mustFilterFields (maybe validation is not complete?) > at org.apache.calcite.avatica.Helper.createException(Helper.java:56) > at org.apache.calcite.avatica.Helper.createException(Helper.java:41) > at org.apache.calcite.avatica.AvaticaStatement.executeInternal(AvaticaStatement.java:164) > at org.apache.calcite.avatica.AvaticaStatement.executeQuery(AvaticaStatement.java:228) > at net.hydromatic.quidem.Quidem.checkResult(Quidem.java:299) > at net.hydromatic.quidem.Quidem.access$2600(Quidem.java:57) > at net.hydromatic.quidem.Quidem$ContextImpl.checkResult(Quidem.java:1636) > at net.hydromatic.quidem.Quidem$CheckResultCommand.execute(Quidem.java:941) > at net.hydromatic.quidem.Quidem$CompositeCommand.execute(Quidem.java:1437) > at net.hydromatic.quidem.Quidem.execute(Quidem.java:190) > at org.apache.calcite.test.QuidemTest.checkRun(QuidemTest.java:178) > at org.apache.calcite.test.QuidemTest.test(QuidemTest.java:239) > at java.base/jdk.internal.reflect.NativeMethodAccessorImpl.invoke0(Native Method) > at java.base/jdk.internal.reflect.NativeMethodAccessorImpl.invoke(NativeMethodAccessorImpl.java:77) > at java.base/jdk.internal.reflect.DelegatingMethodAccessorImpl.invoke(DelegatingMethodAccessorImpl.java:43) > at java.base/java.lang.reflect.Method.invoke(Method.java:568) > at org.junit.platform.commons.util.ReflectionUtils.invokeMethod(ReflectionUtils.java:727) > at org.junit.jupiter.engine.execution.MethodInvocation.proceed(MethodInvocation.java:60) > at org.junit.jupiter.engine.execution.InvocationInterceptorChain$ValidatingInvocation.proceed(InvocationInterceptorChain.java:131) > at org.junit.jupiter.engine.extension.SameThreadTimeoutInvocation.proceed(SameThreadTimeoutInvocation.java:45) > at org.junit.jupiter.engine.extension.TimeoutExtension.intercept(TimeoutExtension.java:156) > at org.junit.jupiter.engine.extension.TimeoutExtension.interceptTestableMethod(TimeoutExtension.java:147) > at org.junit.jupiter.engine.extension.TimeoutExtension.interceptTestTemplateMethod(TimeoutExtension.java:94) > at org.junit.jupiter.engine.execution.InterceptingExecutableInvoker$ReflectiveInterceptorCall.lambda$ofVoidMethod$0(InterceptingExecutableInvoker.java:103) > at org.junit.jupiter.engine.execution.InterceptingExecutableInvoker.lambda$invoke$0(InterceptingExecutableInvoker.java:93) > at org.junit.jupiter.engine.execution.InvocationInterceptorChain$InterceptedInvocation.proceed(InvocationInterceptorChain.java:106) > at org.junit.jupiter.engine.execution.InvocationInterceptorChain.proceed(InvocationInterceptorChain.java:64) > at org.junit.jupiter.engine.execution.InvocationInterceptorChain.chainAndInvoke(InvocationInterceptorChain.java:45) > at org.junit.jupiter.engine.execution.InvocationInterceptorChain.invoke(InvocationInterceptorChain.java:37) > at org.junit.jupiter.engine.execution.InterceptingExecutableInvoker.invoke(InterceptingExecutableInvoker.java:92) > at org.junit.jupiter.engine.execution.InterceptingExecutableInvoker.invoke(InterceptingExecutableInvoker.java:86) > at org.junit.jupiter.engine.descriptor.TestMethodTestDescriptor.lambda$invokeTestMethod$7(TestMethodTestDescriptor.java:217) > at org.junit.platform.engine.support.hierarchical.ThrowableCollector.e
Linux (JDK 17): task ':babel:test'#L1
Execution failed for task ':babel:test': org.gradle.api.tasks.VerificationException: There were failing tests. See the report at: file:///home/runner/work/calcite/calcite/babel/build/reports/tests/test/index.html
Linux (JDK 17)
Execution failed for task ':babel:test'. > There were failing tests. See the report at: file:///home/runner/work/calcite/calcite/babel/build/reports/tests/test/index.html
Linux (JDK 8), oldest Guava, America/New_York Timezone: BabelTest.java#L105
1.7sec org.apache.calcite.test.BabelTest > testInfixCast() java.sql.SQLException: Error while executing SQL "SELECT x::integer FROM (VALUES ('1', '2')) as tbl(x, y)": mustFilterFields (maybe validation is not complete?) at org.apache.calcite.avatica.Helper.createException(Helper.java:56) at org.apache.calcite.avatica.Helper.createException(Helper.java:41) at org.apache.calcite.avatica.AvaticaStatement.executeInternal(AvaticaStatement.java:164) at org.apache.calcite.avatica.AvaticaStatement.executeQuery(AvaticaStatement.java:228) at org.apache.calcite.test.BabelTest.checkInfixCast(BabelTest.java:105) at org.apache.calcite.test.BabelTest.testInfixCast(BabelTest.java:93) Next exception 1: [CIRCULAR REFERENCE SQLException] Next exception 2: java.lang.NullPointerException: mustFilterFields (maybe validation is not complete?) at java.util.Objects.requireNonNull(Objects.java:228) at org.apache.calcite.sql.validate.AbstractNamespace.getMustFilterFields(AbstractNamespace.java:171) at org.apache.calcite.sql.validate.AliasNamespace.getMustFilterFields(AliasNamespace.java:48) at org.apache.calcite.sql.validate.SqlValidatorImpl.validateSelect(SqlValidatorImpl.java:3896) at org.apache.calcite.sql.validate.SelectNamespace.validateImpl(SelectNamespace.java:64) at org.apache.calcite.sql.validate.AbstractNamespace.validate(AbstractNamespace.java:95) at org.apache.calcite.sql.validate.SqlValidatorImpl.validateNamespace(SqlValidatorImpl.java:1164) at org.apache.calcite.sql.validate.SqlValidatorImpl.validateQuery(SqlValidatorImpl.java:1135) at org.apache.calcite.sql.SqlSelect.validate(SqlSelect.java:284) at org.apache.calcite.sql.validate.SqlValidatorImpl.validateScopedExpression(SqlValidatorImpl.java:1101) at org.apache.calcite.sql.validate.SqlValidatorImpl.validate(SqlValidatorImpl.java:807) at org.apache.calcite.sql2rel.SqlToRelConverter.convertQuery(SqlToRelConverter.java:610) at org.apache.calcite.prepare.Prepare.prepareSql(Prepare.java:257) at org.apache.calcite.prepare.Prepare.prepareSql(Prepare.java:220) at org.apache.calcite.prepare.CalcitePrepareImpl.prepare2_(CalcitePrepareImpl.java:666) at org.apache.calcite.prepare.CalcitePrepareImpl.prepare_(CalcitePrepareImpl.java:519) at org.apache.calcite.prepare.CalcitePrepareImpl.prepareSql(CalcitePrepareImpl.java:487) at org.apache.calcite.jdbc.CalciteConnectionImpl.parseQuery(CalciteConnectionImpl.java:236) at org.apache.calcite.jdbc.CalciteMetaImpl.prepareAndExecute(CalciteMetaImpl.java:702) at org.apache.calcite.avatica.AvaticaConnection.prepareAndExecuteInternal(AvaticaConnection.java:677) at org.apache.calcite.avatica.AvaticaStatement.executeInternal(AvaticaStatement.java:157) ... 3 more Caused by: [CIRCULAR REFERENCE NullPointerException]
Linux (JDK 8), oldest Guava, America/New_York Timezone: BabelTest.java#L278
2.6sec org.apache.calcite.test.BabelTest > testNullSafeEqual() java.sql.SQLException: Error while executing SQL "SELECT x <=> 1 + 3 FROM (VALUES (1, 2)) as tbl(x,y)": mustFilterFields (maybe validation is not complete?) at org.apache.calcite.avatica.Helper.createException(Helper.java:56) at org.apache.calcite.avatica.Helper.createException(Helper.java:41) at org.apache.calcite.avatica.AvaticaStatement.executeInternal(AvaticaStatement.java:164) at org.apache.calcite.avatica.AvaticaStatement.executeQuery(AvaticaStatement.java:228) at org.apache.calcite.test.CalciteAssert.assertQuery(CalciteAssert.java:566) at org.apache.calcite.test.CalciteAssert$AssertQuery.lambda$returns$1(CalciteAssert.java:1495) at org.apache.calcite.test.CalciteAssert$AssertQuery.withConnection(CalciteAssert.java:1434) at org.apache.calcite.test.CalciteAssert$AssertQuery.returns(CalciteAssert.java:1493) at org.apache.calcite.test.CalciteAssert$AssertQuery.returns(CalciteAssert.java:1483) at org.apache.calcite.test.CalciteAssert$AssertQuery.returns(CalciteAssert.java:1446) at org.apache.calcite.test.BabelTest.checkSqlResult(BabelTest.java:278) at org.apache.calcite.test.BabelTest.testNullSafeEqual(BabelTest.java:226) Suppressed: org.apache.calcite.util.TestUtil$ExtraInformation: With materializationsEnabled=false, limit=-1 at org.apache.calcite.util.TestUtil.rethrow(TestUtil.java:389) at org.apache.calcite.test.CalciteAssert.assertQuery(CalciteAssert.java:598) ... 7 more Next exception 1: [CIRCULAR REFERENCE SQLException] Next exception 2: java.lang.NullPointerException: mustFilterFields (maybe validation is not complete?) at java.util.Objects.requireNonNull(Objects.java:228) at org.apache.calcite.sql.validate.AbstractNamespace.getMustFilterFields(AbstractNamespace.java:171) at org.apache.calcite.sql.validate.AliasNamespace.getMustFilterFields(AliasNamespace.java:48) at org.apache.calcite.sql.validate.SqlValidatorImpl.validateSelect(SqlValidatorImpl.java:3896) at org.apache.calcite.sql.validate.SelectNamespace.validateImpl(SelectNamespace.java:64) at org.apache.calcite.sql.validate.AbstractNamespace.validate(AbstractNamespace.java:95) at org.apache.calcite.sql.validate.SqlValidatorImpl.validateNamespace(SqlValidatorImpl.java:1164) at org.apache.calcite.sql.validate.SqlValidatorImpl.validateQuery(SqlValidatorImpl.java:1135) at org.apache.calcite.sql.SqlSelect.validate(SqlSelect.java:284) at org.apache.calcite.sql.validate.SqlValidatorImpl.validateScopedExpression(SqlValidatorImpl.java:1101) at org.apache.calcite.sql.validate.SqlValidatorImpl.validate(SqlValidatorImpl.java:807) at org.apache.calcite.sql2rel.SqlToRelConverter.convertQuery(SqlToRelConverter.java:610) at org.apache.calcite.prepare.Prepare.prepareSql(Prepare.java:257) at org.apache.calcite.prepare.Prepare.prepareSql(Prepare.java:220) at org.apache.calcite.prepare.CalcitePrepareImpl.prepare2_(CalcitePrepareImpl.java:666) at org.apache.calcite.prepare.CalcitePrepareImpl.prepare_(CalcitePrepareImpl.java:519) at org.apache.calcite.prepare.CalcitePrepareImpl.prepareSql(CalcitePrepareImpl.java:487) at org.apache.calcite.jdbc.CalciteConnectionImpl.parseQuery(CalciteConnectionImpl.java:236) at org.apache.calcite.jdbc.CalciteMetaImpl.prepareAndExecute(CalciteMetaImpl.java:702) at org.apache.calcite.avatica.AvaticaConnection.prepareAndExecuteInternal(AvaticaConnection.java:677) at org.apache.calcite.avatica.AvaticaStatement.executeInternal(AvaticaStatement.java:157) ... 9 more Caused by: [CIRCULAR REFERENCE NullPointerException]
Linux (JDK 8), oldest Guava, America/New_York Timezone: org.apache.calcite.test.BabelQuidemTest > test(String)[2%5D#L1
4.3sec org.apache.calcite.test.BabelQuidemTest > test(String)[2], [2] sql/big-query.iq org.opentest4j.AssertionFailedError: Files differ: /home/runner/work/calcite/calcite/babel/build/quidem/test/sql/big-query.iq /home/runner/work/calcite/calcite/babel/build/resources/test/sql/big-query.iq 1016,1024c1016,1163 < +-----------------+----------+ < | email | is_valid | < +-----------------+----------+ < | bar@example.org | true | < | foo@example.com | true | < | www.example.net | false | < +-----------------+----------+ < (3 rows) < --- > java.sql.SQLException: Error while executing SQL "SELECT > email, > REGEXP_CONTAINS(email, '@[a-zA-Z0-9-]+\.[a-zA-Z0-9-.]+') AS is_valid > FROM > (SELECT > ARRAY['foo@example.com', 'bar@example.org', 'www.example.net'] > AS addresses), > UNNEST(addresses) AS email": mustFilterFields (maybe validation is not complete?) > at org.apache.calcite.avatica.Helper.createException(Helper.java:56) > at org.apache.calcite.avatica.Helper.createException(Helper.java:41) > at org.apache.calcite.avatica.AvaticaStatement.executeInternal(AvaticaStatement.java:164) > at org.apache.calcite.avatica.AvaticaStatement.executeQuery(AvaticaStatement.java:228) > at net.hydromatic.quidem.Quidem.checkResult(Quidem.java:299) > at net.hydromatic.quidem.Quidem.access$2600(Quidem.java:57) > at net.hydromatic.quidem.Quidem$ContextImpl.checkResult(Quidem.java:1636) > at net.hydromatic.quidem.Quidem$CheckResultCommand.execute(Quidem.java:941) > at net.hydromatic.quidem.Quidem$CompositeCommand.execute(Quidem.java:1437) > at net.hydromatic.quidem.Quidem.execute(Quidem.java:190) > at org.apache.calcite.test.QuidemTest.checkRun(QuidemTest.java:178) > at org.apache.calcite.test.QuidemTest.test(QuidemTest.java:239) > at sun.reflect.NativeMethodAccessorImpl.invoke0(Native Method) > at sun.reflect.NativeMethodAccessorImpl.invoke(NativeMethodAccessorImpl.java:62) > at sun.reflect.DelegatingMethodAccessorImpl.invoke(DelegatingMethodAccessorImpl.java:43) > at java.lang.reflect.Method.invoke(Method.java:498) > at org.junit.platform.commons.util.ReflectionUtils.invokeMethod(ReflectionUtils.java:727) > at org.junit.jupiter.engine.execution.MethodInvocation.proceed(MethodInvocation.java:60) > at org.junit.jupiter.engine.execution.InvocationInterceptorChain$ValidatingInvocation.proceed(InvocationInterceptorChain.java:131) > at org.junit.jupiter.engine.extension.SameThreadTimeoutInvocation.proceed(SameThreadTimeoutInvocation.java:45) > at org.junit.jupiter.engine.extension.TimeoutExtension.intercept(TimeoutExtension.java:156) > at org.junit.jupiter.engine.extension.TimeoutExtension.interceptTestableMethod(TimeoutExtension.java:147) > at org.junit.jupiter.engine.extension.TimeoutExtension.interceptTestTemplateMethod(TimeoutExtension.java:94) > at org.junit.jupiter.engine.execution.InterceptingExecutableInvoker$ReflectiveInterceptorCall.lambda$ofVoidMethod$0(InterceptingExecutableInvoker.java:103) > at org.junit.jupiter.engine.execution.InterceptingExecutableInvoker.lambda$invoke$0(InterceptingExecutableInvoker.java:93) > at org.junit.jupiter.engine.execution.InvocationInterceptorChain$InterceptedInvocation.proceed(InvocationInterceptorChain.java:106) > at org.junit.jupiter.engine.execution.InvocationInterceptorChain.proceed(InvocationInterceptorChain.java:64) > at org.junit.jupiter.engine.execution.InvocationInterceptorChain.chainAndInvoke(InvocationInterceptorChain.java:45) > at org.junit.jupiter.engine.execution.InvocationInterceptorChain.invoke(InvocationInterceptorChain.java:37) > at org.junit.jupiter.engine.execution.InterceptingExecutableInvoker.invoke(InterceptingExecutableInvoker.java:92) > at org.junit.jupiter.engine.execution.InterceptingExecutableInvoker.invoke(InterceptingExecutableInvoker.java:86) > at org.junit.jupiter.engine.descriptor.TestMethodTestDescriptor.lambda$invokeTestMethod$7(TestMethodTestDescriptor.java:217) > at org.junit.platform.engine.support.hierarchical.ThrowableCollector.execute(ThrowableCollector.java:73) > at org.junit.jupiter.engine.d
Linux (JDK 8), oldest Guava, America/New_York Timezone
The operation was canceled.
Linux (JDK 19): BabelTest.java#L105
1.4sec org.apache.calcite.test.BabelTest > testInfixCast() java.sql.SQLException: Error while executing SQL "SELECT x::integer FROM (VALUES ('1', '2')) as tbl(x, y)": mustFilterFields (maybe validation is not complete?) at org.apache.calcite.avatica.Helper.createException(Helper.java:56) at org.apache.calcite.avatica.Helper.createException(Helper.java:41) at org.apache.calcite.avatica.AvaticaStatement.executeInternal(AvaticaStatement.java:164) at org.apache.calcite.avatica.AvaticaStatement.executeQuery(AvaticaStatement.java:228) at org.apache.calcite.test.BabelTest.checkInfixCast(BabelTest.java:105) at org.apache.calcite.test.BabelTest.testInfixCast(BabelTest.java:93) Next exception 1: [CIRCULAR REFERENCE SQLException] Next exception 2: java.lang.NullPointerException: mustFilterFields (maybe validation is not complete?) at java.base/java.util.Objects.requireNonNull(Objects.java:259) at org.apache.calcite.sql.validate.AbstractNamespace.getMustFilterFields(AbstractNamespace.java:171) at org.apache.calcite.sql.validate.AliasNamespace.getMustFilterFields(AliasNamespace.java:48) at org.apache.calcite.sql.validate.SqlValidatorImpl.validateSelect(SqlValidatorImpl.java:3896) at org.apache.calcite.sql.validate.SelectNamespace.validateImpl(SelectNamespace.java:64) at org.apache.calcite.sql.validate.AbstractNamespace.validate(AbstractNamespace.java:95) at org.apache.calcite.sql.validate.SqlValidatorImpl.validateNamespace(SqlValidatorImpl.java:1164) at org.apache.calcite.sql.validate.SqlValidatorImpl.validateQuery(SqlValidatorImpl.java:1135) at org.apache.calcite.sql.SqlSelect.validate(SqlSelect.java:284) at org.apache.calcite.sql.validate.SqlValidatorImpl.validateScopedExpression(SqlValidatorImpl.java:1101) at org.apache.calcite.sql.validate.SqlValidatorImpl.validate(SqlValidatorImpl.java:807) at org.apache.calcite.sql2rel.SqlToRelConverter.convertQuery(SqlToRelConverter.java:610) at org.apache.calcite.prepare.Prepare.prepareSql(Prepare.java:257) at org.apache.calcite.prepare.Prepare.prepareSql(Prepare.java:220) at org.apache.calcite.prepare.CalcitePrepareImpl.prepare2_(CalcitePrepareImpl.java:666) at org.apache.calcite.prepare.CalcitePrepareImpl.prepare_(CalcitePrepareImpl.java:519) at org.apache.calcite.prepare.CalcitePrepareImpl.prepareSql(CalcitePrepareImpl.java:487) at org.apache.calcite.jdbc.CalciteConnectionImpl.parseQuery(CalciteConnectionImpl.java:236) at org.apache.calcite.jdbc.CalciteMetaImpl.prepareAndExecute(CalciteMetaImpl.java:702) at org.apache.calcite.avatica.AvaticaConnection.prepareAndExecuteInternal(AvaticaConnection.java:677) at org.apache.calcite.avatica.AvaticaStatement.executeInternal(AvaticaStatement.java:157) ... 3 more Caused by: [CIRCULAR REFERENCE NullPointerException]
Linux (JDK 19): BabelTest.java#L278
2.0sec org.apache.calcite.test.BabelTest > testNullSafeEqual() java.sql.SQLException: Error while executing SQL "SELECT x <=> 1 + 3 FROM (VALUES (1, 2)) as tbl(x,y)": mustFilterFields (maybe validation is not complete?) at org.apache.calcite.avatica.Helper.createException(Helper.java:56) at org.apache.calcite.avatica.Helper.createException(Helper.java:41) at org.apache.calcite.avatica.AvaticaStatement.executeInternal(AvaticaStatement.java:164) at org.apache.calcite.avatica.AvaticaStatement.executeQuery(AvaticaStatement.java:228) at org.apache.calcite.test.CalciteAssert.assertQuery(CalciteAssert.java:566) at org.apache.calcite.test.CalciteAssert$AssertQuery.lambda$returns$1(CalciteAssert.java:1495) at org.apache.calcite.test.CalciteAssert$AssertQuery.withConnection(CalciteAssert.java:1434) at org.apache.calcite.test.CalciteAssert$AssertQuery.returns(CalciteAssert.java:1493) at org.apache.calcite.test.CalciteAssert$AssertQuery.returns(CalciteAssert.java:1483) at org.apache.calcite.test.CalciteAssert$AssertQuery.returns(CalciteAssert.java:1446) at org.apache.calcite.test.BabelTest.checkSqlResult(BabelTest.java:278) at org.apache.calcite.test.BabelTest.testNullSafeEqual(BabelTest.java:226) Suppressed: org.apache.calcite.util.TestUtil$ExtraInformation: With materializationsEnabled=false, limit=-1 at app//org.apache.calcite.util.TestUtil.rethrow(TestUtil.java:389) at app//org.apache.calcite.test.CalciteAssert.assertQuery(CalciteAssert.java:598) ... 7 more Next exception 1: [CIRCULAR REFERENCE SQLException] Next exception 2: java.lang.NullPointerException: mustFilterFields (maybe validation is not complete?) at java.base/java.util.Objects.requireNonNull(Objects.java:259) at org.apache.calcite.sql.validate.AbstractNamespace.getMustFilterFields(AbstractNamespace.java:171) at org.apache.calcite.sql.validate.AliasNamespace.getMustFilterFields(AliasNamespace.java:48) at org.apache.calcite.sql.validate.SqlValidatorImpl.validateSelect(SqlValidatorImpl.java:3896) at org.apache.calcite.sql.validate.SelectNamespace.validateImpl(SelectNamespace.java:64) at org.apache.calcite.sql.validate.AbstractNamespace.validate(AbstractNamespace.java:95) at org.apache.calcite.sql.validate.SqlValidatorImpl.validateNamespace(SqlValidatorImpl.java:1164) at org.apache.calcite.sql.validate.SqlValidatorImpl.validateQuery(SqlValidatorImpl.java:1135) at org.apache.calcite.sql.SqlSelect.validate(SqlSelect.java:284) at org.apache.calcite.sql.validate.SqlValidatorImpl.validateScopedExpression(SqlValidatorImpl.java:1101) at org.apache.calcite.sql.validate.SqlValidatorImpl.validate(SqlValidatorImpl.java:807) at org.apache.calcite.sql2rel.SqlToRelConverter.convertQuery(SqlToRelConverter.java:610) at org.apache.calcite.prepare.Prepare.prepareSql(Prepare.java:257) at org.apache.calcite.prepare.Prepare.prepareSql(Prepare.java:220) at org.apache.calcite.prepare.CalcitePrepareImpl.prepare2_(CalcitePrepareImpl.java:666) at org.apache.calcite.prepare.CalcitePrepareImpl.prepare_(CalcitePrepareImpl.java:519) at org.apache.calcite.prepare.CalcitePrepareImpl.prepareSql(CalcitePrepareImpl.java:487) at org.apache.calcite.jdbc.CalciteConnectionImpl.parseQuery(CalciteConnectionImpl.java:236) at org.apache.calcite.jdbc.CalciteMetaImpl.prepareAndExecute(CalciteMetaImpl.java:702) at org.apache.calcite.avatica.AvaticaConnection.prepareAndExecuteInternal(AvaticaConnection.java:677) at org.apache.calcite.avatica.AvaticaStatement.executeInternal(AvaticaStatement.java:157) ... 9 more Caused by: [CIRCULAR REFERENCE NullPointerException]
Linux (JDK 19): org.apache.calcite.test.BabelQuidemTest > test(String)[2%5D#L1
4.0sec org.apache.calcite.test.BabelQuidemTest > test(String)[2], [2] sql/big-query.iq org.opentest4j.AssertionFailedError: Files differ: /home/runner/work/calcite/calcite/babel/build/quidem/test/sql/big-query.iq /home/runner/work/calcite/calcite/babel/build/resources/test/sql/big-query.iq 1016,1024c1016,1162 < +-----------------+----------+ < | email | is_valid | < +-----------------+----------+ < | bar@example.org | true | < | foo@example.com | true | < | www.example.net | false | < +-----------------+----------+ < (3 rows) < --- > java.sql.SQLException: Error while executing SQL "SELECT > email, > REGEXP_CONTAINS(email, '@[a-zA-Z0-9-]+\.[a-zA-Z0-9-.]+') AS is_valid > FROM > (SELECT > ARRAY['foo@example.com', 'bar@example.org', 'www.example.net'] > AS addresses), > UNNEST(addresses) AS email": mustFilterFields (maybe validation is not complete?) > at org.apache.calcite.avatica.Helper.createException(Helper.java:56) > at org.apache.calcite.avatica.Helper.createException(Helper.java:41) > at org.apache.calcite.avatica.AvaticaStatement.executeInternal(AvaticaStatement.java:164) > at org.apache.calcite.avatica.AvaticaStatement.executeQuery(AvaticaStatement.java:228) > at net.hydromatic.quidem.Quidem.checkResult(Quidem.java:299) > at net.hydromatic.quidem.Quidem.access$2600(Quidem.java:57) > at net.hydromatic.quidem.Quidem$ContextImpl.checkResult(Quidem.java:1636) > at net.hydromatic.quidem.Quidem$CheckResultCommand.execute(Quidem.java:941) > at net.hydromatic.quidem.Quidem$CompositeCommand.execute(Quidem.java:1437) > at net.hydromatic.quidem.Quidem.execute(Quidem.java:190) > at org.apache.calcite.test.QuidemTest.checkRun(QuidemTest.java:178) > at org.apache.calcite.test.QuidemTest.test(QuidemTest.java:239) > at java.base/jdk.internal.reflect.DirectMethodHandleAccessor.invoke(DirectMethodHandleAccessor.java:104) > at java.base/java.lang.reflect.Method.invoke(Method.java:578) > at org.junit.platform.commons.util.ReflectionUtils.invokeMethod(ReflectionUtils.java:727) > at org.junit.jupiter.engine.execution.MethodInvocation.proceed(MethodInvocation.java:60) > at org.junit.jupiter.engine.execution.InvocationInterceptorChain$ValidatingInvocation.proceed(InvocationInterceptorChain.java:131) > at org.junit.jupiter.engine.extension.SameThreadTimeoutInvocation.proceed(SameThreadTimeoutInvocation.java:45) > at org.junit.jupiter.engine.extension.TimeoutExtension.intercept(TimeoutExtension.java:156) > at org.junit.jupiter.engine.extension.TimeoutExtension.interceptTestableMethod(TimeoutExtension.java:147) > at org.junit.jupiter.engine.extension.TimeoutExtension.interceptTestTemplateMethod(TimeoutExtension.java:94) > at org.junit.jupiter.engine.execution.InterceptingExecutableInvoker$ReflectiveInterceptorCall.lambda$ofVoidMethod$0(InterceptingExecutableInvoker.java:103) > at org.junit.jupiter.engine.execution.InterceptingExecutableInvoker.lambda$invoke$0(InterceptingExecutableInvoker.java:93) > at org.junit.jupiter.engine.execution.InvocationInterceptorChain$InterceptedInvocation.proceed(InvocationInterceptorChain.java:106) > at org.junit.jupiter.engine.execution.InvocationInterceptorChain.proceed(InvocationInterceptorChain.java:64) > at org.junit.jupiter.engine.execution.InvocationInterceptorChain.chainAndInvoke(InvocationInterceptorChain.java:45) > at org.junit.jupiter.engine.execution.InvocationInterceptorChain.invoke(InvocationInterceptorChain.java:37) > at org.junit.jupiter.engine.execution.InterceptingExecutableInvoker.invoke(InterceptingExecutableInvoker.java:92) > at org.junit.jupiter.engine.execution.InterceptingExecutableInvoker.invoke(InterceptingExecutableInvoker.java:86) > at org.junit.jupiter.engine.descriptor.TestMethodTestDescriptor.lambda$invokeTestMethod$7(TestMethodTestDescriptor.java:217) > at org.junit.platform.engine.support.hierarchical.ThrowableCollector.execute(ThrowableCollector.java:73) > at org.junit.jupiter.engine.descriptor.TestMethodTestDescriptor.invokeTestMethod(TestMethodTestDescriptor.java:213) > at org.junit.jupiter.engine.descri
Linux (JDK 19): task ':babel:test'#L1
Execution failed for task ':babel:test': org.gradle.api.tasks.VerificationException: There were failing tests. See the report at: file:///home/runner/work/calcite/calcite/babel/build/reports/tests/test/index.html
Linux (JDK 19)
Execution failed for task ':babel:test'. > There were failing tests. See the report at: file:///home/runner/work/calcite/calcite/babel/build/reports/tests/test/index.html
Windows (JDK 8)
The operation was canceled.
CheckerFramework (JDK 11)
The operation was canceled.
CheckerFramework (JDK 11), oldest Guava
The operation was canceled.
Windows (JDK 17)
The operation was canceled.
macOS (JDK 19)
The operation was canceled.
Linux (JDK 11), Avatica main
The operation was canceled.
Error Prone (JDK 11), latest Guava
Node.js 16 actions are deprecated. Please update the following actions to use Node.js 20: actions/checkout@v3, actions/setup-java@v2, burrunan/gradle-cache-action@v1. For more information see: https://github.blog/changelog/2023-09-22-github-actions-transitioning-from-node-16-to-node-20/.
Error Prone (JDK 11), latest Guava
The following actions uses node12 which is deprecated and will be forced to run on node16: actions/setup-java@v2. For more info: https://github.blog/changelog/2023-06-13-github-actions-all-actions-will-run-on-node16-instead-of-node12-by-default/
Linux (JDK 11), Pacific/Chatham Timezone
Node.js 16 actions are deprecated. Please update the following actions to use Node.js 20: actions/checkout@v3, actions/setup-java@v2, burrunan/gradle-cache-action@v1. For more information see: https://github.blog/changelog/2023-09-22-github-actions-transitioning-from-node-16-to-node-20/.
Linux (JDK 11), Pacific/Chatham Timezone
The following actions uses node12 which is deprecated and will be forced to run on node16: actions/setup-java@v2. For more info: https://github.blog/changelog/2023-06-13-github-actions-all-actions-will-run-on-node16-instead-of-node12-by-default/
Druid Tests
Node.js 16 actions are deprecated. Please update the following actions to use Node.js 20: actions/setup-java@v2, actions/checkout@v3. For more information see: https://github.blog/changelog/2023-09-22-github-actions-transitioning-from-node-16-to-node-20/.
Druid Tests
The following actions uses node12 which is deprecated and will be forced to run on node16: actions/setup-java@v2. For more info: https://github.blog/changelog/2023-06-13-github-actions-all-actions-will-run-on-node16-instead-of-node12-by-default/
Linux (JDK 8), latest Guava, America/New_York Timezone
Node.js 16 actions are deprecated. Please update the following actions to use Node.js 20: actions/checkout@v3, actions/setup-java@v2, burrunan/gradle-cache-action@v1. For more information see: https://github.blog/changelog/2023-09-22-github-actions-transitioning-from-node-16-to-node-20/.
Linux (JDK 8), latest Guava, America/New_York Timezone
The following actions uses node12 which is deprecated and will be forced to run on node16: actions/setup-java@v2. For more info: https://github.blog/changelog/2023-06-13-github-actions-all-actions-will-run-on-node16-instead-of-node12-by-default/
Linux (JDK 17)
Node.js 16 actions are deprecated. Please update the following actions to use Node.js 20: actions/checkout@v3, actions/setup-java@v2, burrunan/gradle-cache-action@v1. For more information see: https://github.blog/changelog/2023-09-22-github-actions-transitioning-from-node-16-to-node-20/.
Linux (JDK 17)
The following actions uses node12 which is deprecated and will be forced to run on node16: actions/setup-java@v2. For more info: https://github.blog/changelog/2023-06-13-github-actions-all-actions-will-run-on-node16-instead-of-node12-by-default/
Linux (JDK 8), oldest Guava, America/New_York Timezone
Node.js 16 actions are deprecated. Please update the following actions to use Node.js 20: actions/checkout@v3, actions/setup-java@v2, burrunan/gradle-cache-action@v1. For more information see: https://github.blog/changelog/2023-09-22-github-actions-transitioning-from-node-16-to-node-20/.
Linux (JDK 8), oldest Guava, America/New_York Timezone
The following actions uses node12 which is deprecated and will be forced to run on node16: actions/setup-java@v2. For more info: https://github.blog/changelog/2023-06-13-github-actions-all-actions-will-run-on-node16-instead-of-node12-by-default/
Linux (JDK 19)
Node.js 16 actions are deprecated. Please update the following actions to use Node.js 20: actions/checkout@v3, actions/setup-java@v2, burrunan/gradle-cache-action@v1. For more information see: https://github.blog/changelog/2023-09-22-github-actions-transitioning-from-node-16-to-node-20/.
Linux (JDK 19)
The following actions uses node12 which is deprecated and will be forced to run on node16: actions/setup-java@v2. For more info: https://github.blog/changelog/2023-06-13-github-actions-all-actions-will-run-on-node16-instead-of-node12-by-default/
Windows (JDK 8)
Node.js 16 actions are deprecated. Please update the following actions to use Node.js 20: actions/checkout@v3, actions/setup-java@v2, burrunan/gradle-cache-action@v1. For more information see: https://github.blog/changelog/2023-09-22-github-actions-transitioning-from-node-16-to-node-20/.
Windows (JDK 8)
The following actions uses node12 which is deprecated and will be forced to run on node16: actions/setup-java@v2. For more info: https://github.blog/changelog/2023-06-13-github-actions-all-actions-will-run-on-node16-instead-of-node12-by-default/
CheckerFramework (JDK 11)
Node.js 16 actions are deprecated. Please update the following actions to use Node.js 20: actions/checkout@v3, actions/setup-java@v2, burrunan/gradle-cache-action@v1. For more information see: https://github.blog/changelog/2023-09-22-github-actions-transitioning-from-node-16-to-node-20/.
CheckerFramework (JDK 11)
The following actions uses node12 which is deprecated and will be forced to run on node16: actions/setup-java@v2. For more info: https://github.blog/changelog/2023-06-13-github-actions-all-actions-will-run-on-node16-instead-of-node12-by-default/
CheckerFramework (JDK 11), oldest Guava
Node.js 16 actions are deprecated. Please update the following actions to use Node.js 20: actions/checkout@v3, actions/setup-java@v2, burrunan/gradle-cache-action@v1. For more information see: https://github.blog/changelog/2023-09-22-github-actions-transitioning-from-node-16-to-node-20/.
CheckerFramework (JDK 11), oldest Guava
The following actions uses node12 which is deprecated and will be forced to run on node16: actions/setup-java@v2. For more info: https://github.blog/changelog/2023-06-13-github-actions-all-actions-will-run-on-node16-instead-of-node12-by-default/
Windows (JDK 17)
Node.js 16 actions are deprecated. Please update the following actions to use Node.js 20: actions/checkout@v3, actions/setup-java@v2, burrunan/gradle-cache-action@v1. For more information see: https://github.blog/changelog/2023-09-22-github-actions-transitioning-from-node-16-to-node-20/.
Windows (JDK 17)
The following actions uses node12 which is deprecated and will be forced to run on node16: actions/setup-java@v2. For more info: https://github.blog/changelog/2023-06-13-github-actions-all-actions-will-run-on-node16-instead-of-node12-by-default/
macOS (JDK 19)
Node.js 16 actions are deprecated. Please update the following actions to use Node.js 20: actions/checkout@v3, actions/setup-java@v2, burrunan/gradle-cache-action@v1. For more information see: https://github.blog/changelog/2023-09-22-github-actions-transitioning-from-node-16-to-node-20/.
macOS (JDK 19)
The following actions uses node12 which is deprecated and will be forced to run on node16: actions/setup-java@v2. For more info: https://github.blog/changelog/2023-06-13-github-actions-all-actions-will-run-on-node16-instead-of-node12-by-default/
Linux (JDK 11), Avatica main
Node.js 16 actions are deprecated. Please update the following actions to use Node.js 20: actions/setup-java@v2, burrunan/gradle-cache-action@v1, actions/checkout@v3. For more information see: https://github.blog/changelog/2023-09-22-github-actions-transitioning-from-node-16-to-node-20/.
Linux (JDK 11), Avatica main
The following actions uses node12 which is deprecated and will be forced to run on node16: actions/setup-java@v2. For more info: https://github.blog/changelog/2023-06-13-github-actions-all-actions-will-run-on-node16-instead-of-node12-by-default/
Linux (JDK 11), Avatica main
Failed to save: "/usr/bin/tar" failed with error: The process '/usr/bin/tar' failed with exit code 1