Skip to content

Offset in child #1484

Offset in child

Offset in child #1484

Triggered via push February 17, 2024 01:25
Status Failure
Total duration 9m 49s
Artifacts

main.yml

on: push
Windows (JDK 8)
6m 30s
Windows (JDK 8)
Windows (JDK 17)
4m 48s
Windows (JDK 17)
Linux (JDK 8), oldest Guava, America/New_York Timezone
4m 33s
Linux (JDK 8), oldest Guava, America/New_York Timezone
Linux (JDK 8), latest Guava, America/New_York Timezone
4m 47s
Linux (JDK 8), latest Guava, America/New_York Timezone
Linux (JDK 11), Pacific/Chatham Timezone
3m 36s
Linux (JDK 11), Pacific/Chatham Timezone
Linux (JDK 17)
3m 18s
Linux (JDK 17)
Linux (JDK 19)
3m 18s
Linux (JDK 19)
Linux (JDK 11), Avatica main
5m 8s
Linux (JDK 11), Avatica main
macOS (JDK 19)
8m 56s
macOS (JDK 19)
Error Prone (JDK 11), latest Guava
2m 27s
Error Prone (JDK 11), latest Guava
CheckerFramework (JDK 11)
9m 36s
CheckerFramework (JDK 11)
CheckerFramework (JDK 11), oldest Guava
9m 28s
CheckerFramework (JDK 11), oldest Guava
Linux (JDK 8) Slow Tests
0s
Linux (JDK 8) Slow Tests
Druid Tests
6m 54s
Druid Tests
Fit to window
Zoom out
Zoom in

Annotations

26 errors and 26 warnings
Error Prone (JDK 11), latest Guava: task ':core:compileJava'#L1
Execution failed for task ':core:compileJava': org.gradle.api.internal.tasks.compile.CompilationFailedException: Compilation failed; see the compiler error output for details. at org.gradle.api.internal.tasks.compile.JdkJavaCompiler.execute(JdkJavaCompiler.java:58) at org.gradle.api.internal.tasks.compile.JdkJavaCompiler.execute(JdkJavaCompiler.java:41) at org.gradle.api.internal.tasks.compile.NormalizingJavaCompiler.delegateAndHandleErrors(NormalizingJavaCompiler.java:98) at org.gradle.api.internal.tasks.compile.NormalizingJavaCompiler.execute(NormalizingJavaCompiler.java:52) at org.gradle.api.internal.tasks.compile.NormalizingJavaCompiler.execute(NormalizingJavaCompiler.java:38) at org.gradle.api.internal.tasks.compile.AnnotationProcessorDiscoveringCompiler.execute(AnnotationProcessorDiscoveringCompiler.java:51) at org.gradle.api.internal.tasks.compile.AnnotationProcessorDiscoveringCompiler.execute(AnnotationProcessorDiscoveringCompiler.java:37) at org.gradle.api.internal.tasks.compile.ModuleApplicationNameWritingCompiler.execute(ModuleApplicationNameWritingCompiler.java:46) at org.gradle.api.internal.tasks.compile.ModuleApplicationNameWritingCompiler.execute(ModuleApplicationNameWritingCompiler.java:36) at org.gradle.jvm.toolchain.internal.DefaultToolchainJavaCompiler.execute(DefaultToolchainJavaCompiler.java:57) at org.gradle.api.tasks.compile.JavaCompile.lambda$createToolchainCompiler$1(JavaCompile.java:237) at org.gradle.api.internal.tasks.compile.CleaningJavaCompiler.execute(CleaningJavaCompiler.java:53) at org.gradle.api.internal.tasks.compile.incremental.IncrementalCompilerFactory.lambda$createRebuildAllCompiler$0(IncrementalCompilerFactory.java:52) at org.gradle.api.internal.tasks.compile.incremental.SelectiveCompiler.execute(SelectiveCompiler.java:70) at org.gradle.api.internal.tasks.compile.incremental.SelectiveCompiler.execute(SelectiveCompiler.java:44) at org.gradle.api.internal.tasks.compile.incremental.IncrementalResultStoringCompiler.execute(IncrementalResultStoringCompiler.java:66) at org.gradle.api.internal.tasks.compile.incremental.IncrementalResultStoringCompiler.execute(IncrementalResultStoringCompiler.java:52) at org.gradle.api.internal.tasks.compile.CompileJavaBuildOperationReportingCompiler$2.call(CompileJavaBuildOperationReportingCompiler.java:59) at org.gradle.api.internal.tasks.compile.CompileJavaBuildOperationReportingCompiler$2.call(CompileJavaBuildOperationReportingCompiler.java:51) at org.gradle.internal.operations.DefaultBuildOperationRunner$CallableBuildOperationWorker.execute(DefaultBuildOperationRunner.java:204) at org.gradle.internal.operations.DefaultBuildOperationRunner$CallableBuildOperationWorker.execute(DefaultBuildOperationRunner.java:199) at org.gradle.internal.operations.DefaultBuildOperationRunner$2.execute(DefaultBuildOperationRunner.java:66) at org.gradle.internal.operations.DefaultBuildOperationRunner$2.execute(DefaultBuildOperationRunner.java:59) at org.gradle.internal.operations.DefaultBuildOperationRunner.execute(DefaultBuildOperationRunner.java:157) at org.gradle.internal.operations.DefaultBuildOperationRunner.execute(DefaultBuildOperationRunner.java:59) at org.gradle.internal.operations.DefaultBuildOperationRunner.call(DefaultBuildOperationRunner.java:53) at org.gradle.internal.operations.DefaultBuildOperationExecutor.call(DefaultBuildOperationExecutor.java:73) at org.gradle.api.internal.tasks.compile.CompileJavaBuildOperationReportingCompiler.execute(CompileJavaBuildOperationReportingCompiler.java:51) at org.gradle.api.tasks.compile.JavaCompile.performCompilation(JavaCompile.java:288) at org.gradle.api.tasks.compile.JavaCompile.performIncrementalCompilation(JavaCompile.java:170) at org.gradle.api.tasks.compile.JavaCompile.compile(JavaCompile.java:148) at org.gradle.internal.reflect.JavaMethod.invoke(JavaMethod.j
Error Prone (JDK 11), latest Guava
Execution failed for task ':core:compileJava'. > Compilation failed; see the compiler error output for details.
Linux (JDK 17): task ':core:autostyleJavaCheck'#L1
Execution failed for task ':core:autostyleJavaCheck': See 'What went wrong' below
Linux (JDK 17)
Execution failed for task ':core:autostyleJavaCheck'. > The following files have format violations: core/src/main/java/org/apache/calcite/sql/validate/ListScope.java @@ -34,9 +34,10 @@ import java.util.Map; import java.util.Objects; -import static java.util.Objects.requireNonNull; import static org.apache.calcite.util.Static.RESOURCE; +import static java.util.Objects.requireNonNull; + /** * Abstract base for a scope which is defined by a list of child namespaces and * which inherits from a parent scope. Run './gradlew autostyleApply' to fix the violations.
Linux (JDK 19): task ':core:autostyleJavaCheck'#L1
Execution failed for task ':core:autostyleJavaCheck': See 'What went wrong' below
Linux (JDK 19)
Execution failed for task ':core:autostyleJavaCheck'. > The following files have format violations: core/src/main/java/org/apache/calcite/sql/validate/ListScope.java @@ -34,9 +34,10 @@ import java.util.Map; import java.util.Objects; -import static java.util.Objects.requireNonNull; import static org.apache.calcite.util.Static.RESOURCE; +import static java.util.Objects.requireNonNull; + /** * Abstract base for a scope which is defined by a list of child namespaces and * which inherits from a parent scope. Run './gradlew autostyleApply' to fix the violations.
Linux (JDK 11), Pacific/Chatham Timezone: task ':core:autostyleJavaCheck'#L1
Execution failed for task ':core:autostyleJavaCheck': See 'What went wrong' below
Linux (JDK 11), Pacific/Chatham Timezone
Execution failed for task ':core:autostyleJavaCheck'. > The following files have format violations: core/src/main/java/org/apache/calcite/sql/validate/ListScope.java @@ -34,9 +34,10 @@ import java.util.Map; import java.util.Objects; -import static java.util.Objects.requireNonNull; import static org.apache.calcite.util.Static.RESOURCE; +import static java.util.Objects.requireNonNull; + /** * Abstract base for a scope which is defined by a list of child namespaces and * which inherits from a parent scope. Run './gradlew autostyleApply' to fix the violations.
Linux (JDK 8), oldest Guava, America/New_York Timezone: task ':core:autostyleJavaCheck'#L1
Execution failed for task ':core:autostyleJavaCheck': See 'What went wrong' below
Linux (JDK 8), oldest Guava, America/New_York Timezone
Execution failed for task ':core:autostyleJavaCheck'. > The following files have format violations: core/src/main/java/org/apache/calcite/sql/validate/ListScope.java @@ -34,9 +34,10 @@ import java.util.Map; import java.util.Objects; -import static java.util.Objects.requireNonNull; import static org.apache.calcite.util.Static.RESOURCE; +import static java.util.Objects.requireNonNull; + /** * Abstract base for a scope which is defined by a list of child namespaces and * which inherits from a parent scope. Run './gradlew autostyleApply' to fix the violations.
Linux (JDK 8), latest Guava, America/New_York Timezone: task ':core:autostyleJavaCheck'#L1
Execution failed for task ':core:autostyleJavaCheck': See 'What went wrong' below
Linux (JDK 8), latest Guava, America/New_York Timezone
Execution failed for task ':core:autostyleJavaCheck'. > The following files have format violations: core/src/main/java/org/apache/calcite/sql/validate/ListScope.java @@ -34,9 +34,10 @@ import java.util.Map; import java.util.Objects; -import static java.util.Objects.requireNonNull; import static org.apache.calcite.util.Static.RESOURCE; +import static java.util.Objects.requireNonNull; + /** * Abstract base for a scope which is defined by a list of child namespaces and * which inherits from a parent scope. Run './gradlew autostyleApply' to fix the violations.
Windows (JDK 17): task ':core:autostyleJavaCheck'#L1
Execution failed for task ':core:autostyleJavaCheck': See 'What went wrong' below
Windows (JDK 17)
Execution failed for task ':core:autostyleJavaCheck'. > The following files have format violations: core\src\main\java\org\apache\calcite\sql\validate\ListScope.java @@ -34,9 +34,10 @@ import java.util.Map; import java.util.Objects; -import static java.util.Objects.requireNonNull; import static org.apache.calcite.util.Static.RESOURCE; +import static java.util.Objects.requireNonNull; + /** * Abstract base for a scope which is defined by a list of child namespaces and * which inherits from a parent scope. Run './gradlew autostyleApply' to fix the violations.
Linux (JDK 11), Avatica main: task ':core:autostyleJavaCheck'#L1
Execution failed for task ':core:autostyleJavaCheck': See 'What went wrong' below
Linux (JDK 11), Avatica main
Execution failed for task ':core:autostyleJavaCheck'. > The following files have format violations: core/src/main/java/org/apache/calcite/sql/validate/ListScope.java @@ -34,9 +34,10 @@ import java.util.Map; import java.util.Objects; -import static java.util.Objects.requireNonNull; import static org.apache.calcite.util.Static.RESOURCE; +import static java.util.Objects.requireNonNull; + /** * Abstract base for a scope which is defined by a list of child namespaces and * which inherits from a parent scope. Run './gradlew autostyleApply' to fix the violations.
Windows (JDK 8): task ':core:autostyleJavaCheck'#L1
Execution failed for task ':core:autostyleJavaCheck': See 'What went wrong' below
Windows (JDK 8)
Execution failed for task ':core:autostyleJavaCheck'. > The following files have format violations: core\src\main\java\org\apache\calcite\sql\validate\ListScope.java @@ -34,9 +34,10 @@ import java.util.Map; import java.util.Objects; -import static java.util.Objects.requireNonNull; import static org.apache.calcite.util.Static.RESOURCE; +import static java.util.Objects.requireNonNull; + /** * Abstract base for a scope which is defined by a list of child namespaces and * which inherits from a parent scope. Run './gradlew autostyleApply' to fix the violations.
macOS (JDK 19): task ':core:autostyleJavaCheck'#L1
Execution failed for task ':core:autostyleJavaCheck': See 'What went wrong' below
macOS (JDK 19)
Execution failed for task ':core:autostyleJavaCheck'. > The following files have format violations: core/src/main/java/org/apache/calcite/sql/validate/ListScope.java @@ -34,9 +34,10 @@ import java.util.Map; import java.util.Objects; -import static java.util.Objects.requireNonNull; import static org.apache.calcite.util.Static.RESOURCE; +import static java.util.Objects.requireNonNull; + /** * Abstract base for a scope which is defined by a list of child namespaces and * which inherits from a parent scope. Run './gradlew autostyleApply' to fix the violations.
CheckerFramework (JDK 11), oldest Guava: task ':core:compileJava'#L1
Execution failed for task ':core:compileJava': org.gradle.api.internal.tasks.compile.CompilationFailedException: Compilation failed; see the compiler error output for details. at org.gradle.api.internal.tasks.compile.JdkJavaCompiler.execute(JdkJavaCompiler.java:58) at org.gradle.api.internal.tasks.compile.JdkJavaCompiler.execute(JdkJavaCompiler.java:41) at org.gradle.api.internal.tasks.compile.daemon.AbstractDaemonCompiler$CompilerWorkAction.execute(AbstractDaemonCompiler.java:135) at org.gradle.workers.internal.DefaultWorkerServer.execute(DefaultWorkerServer.java:63) at org.gradle.workers.internal.AbstractClassLoaderWorker$1.create(AbstractClassLoaderWorker.java:49) at org.gradle.workers.internal.AbstractClassLoaderWorker$1.create(AbstractClassLoaderWorker.java:43) at org.gradle.internal.classloader.ClassLoaderUtils.executeInClassloader(ClassLoaderUtils.java:100) at org.gradle.workers.internal.AbstractClassLoaderWorker.executeInClassLoader(AbstractClassLoaderWorker.java:43) at org.gradle.workers.internal.FlatClassLoaderWorker.run(FlatClassLoaderWorker.java:32) at org.gradle.workers.internal.FlatClassLoaderWorker.run(FlatClassLoaderWorker.java:22) at org.gradle.workers.internal.WorkerDaemonServer.run(WorkerDaemonServer.java:87) at org.gradle.workers.internal.WorkerDaemonServer.run(WorkerDaemonServer.java:56) at org.gradle.process.internal.worker.request.WorkerAction$1.call(WorkerAction.java:138) at org.gradle.process.internal.worker.child.WorkerLogEventListener.withWorkerLoggingProtocol(WorkerLogEventListener.java:41) at org.gradle.process.internal.worker.request.WorkerAction.run(WorkerAction.java:135) at org.gradle.internal.dispatch.ReflectionDispatch.dispatch(ReflectionDispatch.java:36) at org.gradle.internal.dispatch.ReflectionDispatch.dispatch(ReflectionDispatch.java:24) at org.gradle.internal.remote.internal.hub.MessageHubBackedObjectConnection$DispatchWrapper.dispatch(MessageHubBackedObjectConnection.java:182) at org.gradle.internal.remote.internal.hub.MessageHubBackedObjectConnection$DispatchWrapper.dispatch(MessageHubBackedObjectConnection.java:164) at org.gradle.internal.remote.internal.hub.MessageHub$Handler.run(MessageHub.java:414) at org.gradle.internal.concurrent.ExecutorPolicy$CatchAndRecordFailures.onExecute(ExecutorPolicy.java:64) at org.gradle.internal.concurrent.ManagedExecutorImpl$1.run(ManagedExecutorImpl.java:49) at java.base/java.util.concurrent.ThreadPoolExecutor.runWorker(ThreadPoolExecutor.java:1128) at java.base/java.util.concurrent.ThreadPoolExecutor$Worker.run(ThreadPoolExecutor.java:628) at java.base/java.lang.Thread.run(Thread.java:829)
CheckerFramework (JDK 11), oldest Guava
Execution failed for task ':core:compileJava'. > Compilation failed; see the compiler error output for details.
CheckerFramework (JDK 11), oldest Guava: core/src/main/java/org/apache/calcite/sql/validate/SqlQualified.java#L55
[Task :core:compileJava] [override.param.invalid] Incompatible parameter type for obj. @OverRide public boolean equals(Object obj) { ^ found : @initialized @nonnull Object
CheckerFramework (JDK 11): task ':core:compileJava'#L1
Execution failed for task ':core:compileJava': org.gradle.api.internal.tasks.compile.CompilationFailedException: Compilation failed; see the compiler error output for details. at org.gradle.api.internal.tasks.compile.JdkJavaCompiler.execute(JdkJavaCompiler.java:58) at org.gradle.api.internal.tasks.compile.JdkJavaCompiler.execute(JdkJavaCompiler.java:41) at org.gradle.api.internal.tasks.compile.daemon.AbstractDaemonCompiler$CompilerWorkAction.execute(AbstractDaemonCompiler.java:135) at org.gradle.workers.internal.DefaultWorkerServer.execute(DefaultWorkerServer.java:63) at org.gradle.workers.internal.AbstractClassLoaderWorker$1.create(AbstractClassLoaderWorker.java:49) at org.gradle.workers.internal.AbstractClassLoaderWorker$1.create(AbstractClassLoaderWorker.java:43) at org.gradle.internal.classloader.ClassLoaderUtils.executeInClassloader(ClassLoaderUtils.java:100) at org.gradle.workers.internal.AbstractClassLoaderWorker.executeInClassLoader(AbstractClassLoaderWorker.java:43) at org.gradle.workers.internal.FlatClassLoaderWorker.run(FlatClassLoaderWorker.java:32) at org.gradle.workers.internal.FlatClassLoaderWorker.run(FlatClassLoaderWorker.java:22) at org.gradle.workers.internal.WorkerDaemonServer.run(WorkerDaemonServer.java:87) at org.gradle.workers.internal.WorkerDaemonServer.run(WorkerDaemonServer.java:56) at org.gradle.process.internal.worker.request.WorkerAction$1.call(WorkerAction.java:138) at org.gradle.process.internal.worker.child.WorkerLogEventListener.withWorkerLoggingProtocol(WorkerLogEventListener.java:41) at org.gradle.process.internal.worker.request.WorkerAction.run(WorkerAction.java:135) at org.gradle.internal.dispatch.ReflectionDispatch.dispatch(ReflectionDispatch.java:36) at org.gradle.internal.dispatch.ReflectionDispatch.dispatch(ReflectionDispatch.java:24) at org.gradle.internal.remote.internal.hub.MessageHubBackedObjectConnection$DispatchWrapper.dispatch(MessageHubBackedObjectConnection.java:182) at org.gradle.internal.remote.internal.hub.MessageHubBackedObjectConnection$DispatchWrapper.dispatch(MessageHubBackedObjectConnection.java:164) at org.gradle.internal.remote.internal.hub.MessageHub$Handler.run(MessageHub.java:414) at org.gradle.internal.concurrent.ExecutorPolicy$CatchAndRecordFailures.onExecute(ExecutorPolicy.java:64) at org.gradle.internal.concurrent.ManagedExecutorImpl$1.run(ManagedExecutorImpl.java:49) at java.base/java.util.concurrent.ThreadPoolExecutor.runWorker(ThreadPoolExecutor.java:1128) at java.base/java.util.concurrent.ThreadPoolExecutor$Worker.run(ThreadPoolExecutor.java:628) at java.base/java.lang.Thread.run(Thread.java:829)
CheckerFramework (JDK 11)
Execution failed for task ':core:compileJava'. > Compilation failed; see the compiler error output for details.
CheckerFramework (JDK 11): core/src/main/java/org/apache/calcite/sql/validate/SqlQualified.java#L55
[Task :core:compileJava] [override.param.invalid] Incompatible parameter type for obj. @OverRide public boolean equals(Object obj) { ^ found : @initialized @nonnull Object
Error Prone (JDK 11), latest Guava
Node.js 16 actions are deprecated. Please update the following actions to use Node.js 20: actions/checkout@v3, actions/setup-java@v2, burrunan/gradle-cache-action@v1. For more information see: https://github.blog/changelog/2023-09-22-github-actions-transitioning-from-node-16-to-node-20/.
Error Prone (JDK 11), latest Guava
The following actions uses node12 which is deprecated and will be forced to run on node16: actions/setup-java@v2. For more info: https://github.blog/changelog/2023-06-13-github-actions-all-actions-will-run-on-node16-instead-of-node12-by-default/
Linux (JDK 17)
Node.js 16 actions are deprecated. Please update the following actions to use Node.js 20: actions/checkout@v3, actions/setup-java@v2, burrunan/gradle-cache-action@v1. For more information see: https://github.blog/changelog/2023-09-22-github-actions-transitioning-from-node-16-to-node-20/.
Linux (JDK 17)
The following actions uses node12 which is deprecated and will be forced to run on node16: actions/setup-java@v2. For more info: https://github.blog/changelog/2023-06-13-github-actions-all-actions-will-run-on-node16-instead-of-node12-by-default/
Linux (JDK 19)
Node.js 16 actions are deprecated. Please update the following actions to use Node.js 20: actions/checkout@v3, actions/setup-java@v2, burrunan/gradle-cache-action@v1. For more information see: https://github.blog/changelog/2023-09-22-github-actions-transitioning-from-node-16-to-node-20/.
Linux (JDK 19)
The following actions uses node12 which is deprecated and will be forced to run on node16: actions/setup-java@v2. For more info: https://github.blog/changelog/2023-06-13-github-actions-all-actions-will-run-on-node16-instead-of-node12-by-default/
Linux (JDK 11), Pacific/Chatham Timezone
Node.js 16 actions are deprecated. Please update the following actions to use Node.js 20: actions/checkout@v3, actions/setup-java@v2, burrunan/gradle-cache-action@v1. For more information see: https://github.blog/changelog/2023-09-22-github-actions-transitioning-from-node-16-to-node-20/.
Linux (JDK 11), Pacific/Chatham Timezone
The following actions uses node12 which is deprecated and will be forced to run on node16: actions/setup-java@v2. For more info: https://github.blog/changelog/2023-06-13-github-actions-all-actions-will-run-on-node16-instead-of-node12-by-default/
Linux (JDK 8), oldest Guava, America/New_York Timezone
Node.js 16 actions are deprecated. Please update the following actions to use Node.js 20: actions/checkout@v3, actions/setup-java@v2, burrunan/gradle-cache-action@v1. For more information see: https://github.blog/changelog/2023-09-22-github-actions-transitioning-from-node-16-to-node-20/.
Linux (JDK 8), oldest Guava, America/New_York Timezone
The following actions uses node12 which is deprecated and will be forced to run on node16: actions/setup-java@v2. For more info: https://github.blog/changelog/2023-06-13-github-actions-all-actions-will-run-on-node16-instead-of-node12-by-default/
Linux (JDK 8), latest Guava, America/New_York Timezone
Node.js 16 actions are deprecated. Please update the following actions to use Node.js 20: actions/checkout@v3, actions/setup-java@v2, burrunan/gradle-cache-action@v1. For more information see: https://github.blog/changelog/2023-09-22-github-actions-transitioning-from-node-16-to-node-20/.
Linux (JDK 8), latest Guava, America/New_York Timezone
The following actions uses node12 which is deprecated and will be forced to run on node16: actions/setup-java@v2. For more info: https://github.blog/changelog/2023-06-13-github-actions-all-actions-will-run-on-node16-instead-of-node12-by-default/
Windows (JDK 17)
Node.js 16 actions are deprecated. Please update the following actions to use Node.js 20: actions/checkout@v3, actions/setup-java@v2, burrunan/gradle-cache-action@v1. For more information see: https://github.blog/changelog/2023-09-22-github-actions-transitioning-from-node-16-to-node-20/.
Windows (JDK 17)
The following actions uses node12 which is deprecated and will be forced to run on node16: actions/setup-java@v2. For more info: https://github.blog/changelog/2023-06-13-github-actions-all-actions-will-run-on-node16-instead-of-node12-by-default/
Linux (JDK 11), Avatica main
Node.js 16 actions are deprecated. Please update the following actions to use Node.js 20: actions/setup-java@v2, burrunan/gradle-cache-action@v1, actions/checkout@v3. For more information see: https://github.blog/changelog/2023-09-22-github-actions-transitioning-from-node-16-to-node-20/.
Linux (JDK 11), Avatica main
The following actions uses node12 which is deprecated and will be forced to run on node16: actions/setup-java@v2. For more info: https://github.blog/changelog/2023-06-13-github-actions-all-actions-will-run-on-node16-instead-of-node12-by-default/
Windows (JDK 8)
Node.js 16 actions are deprecated. Please update the following actions to use Node.js 20: actions/checkout@v3, actions/setup-java@v2, burrunan/gradle-cache-action@v1. For more information see: https://github.blog/changelog/2023-09-22-github-actions-transitioning-from-node-16-to-node-20/.
Windows (JDK 8)
The following actions uses node12 which is deprecated and will be forced to run on node16: actions/setup-java@v2. For more info: https://github.blog/changelog/2023-06-13-github-actions-all-actions-will-run-on-node16-instead-of-node12-by-default/
Druid Tests
Node.js 16 actions are deprecated. Please update the following actions to use Node.js 20: actions/setup-java@v2, actions/checkout@v3, burrunan/gradle-cache-action@v1. For more information see: https://github.blog/changelog/2023-09-22-github-actions-transitioning-from-node-16-to-node-20/.
Druid Tests
The following actions uses node12 which is deprecated and will be forced to run on node16: actions/setup-java@v2. For more info: https://github.blog/changelog/2023-06-13-github-actions-all-actions-will-run-on-node16-instead-of-node12-by-default/
macOS (JDK 19)
Node.js 16 actions are deprecated. Please update the following actions to use Node.js 20: actions/checkout@v3, actions/setup-java@v2, burrunan/gradle-cache-action@v1. For more information see: https://github.blog/changelog/2023-09-22-github-actions-transitioning-from-node-16-to-node-20/.
macOS (JDK 19)
The following actions uses node12 which is deprecated and will be forced to run on node16: actions/setup-java@v2. For more info: https://github.blog/changelog/2023-06-13-github-actions-all-actions-will-run-on-node16-instead-of-node12-by-default/
CheckerFramework (JDK 11), oldest Guava
Node.js 16 actions are deprecated. Please update the following actions to use Node.js 20: actions/checkout@v3, actions/setup-java@v2, burrunan/gradle-cache-action@v1. For more information see: https://github.blog/changelog/2023-09-22-github-actions-transitioning-from-node-16-to-node-20/.
CheckerFramework (JDK 11), oldest Guava
The following actions uses node12 which is deprecated and will be forced to run on node16: actions/setup-java@v2. For more info: https://github.blog/changelog/2023-06-13-github-actions-all-actions-will-run-on-node16-instead-of-node12-by-default/
CheckerFramework (JDK 11)
Node.js 16 actions are deprecated. Please update the following actions to use Node.js 20: actions/checkout@v3, actions/setup-java@v2, burrunan/gradle-cache-action@v1. For more information see: https://github.blog/changelog/2023-09-22-github-actions-transitioning-from-node-16-to-node-20/.
CheckerFramework (JDK 11)
The following actions uses node12 which is deprecated and will be forced to run on node16: actions/setup-java@v2. For more info: https://github.blog/changelog/2023-06-13-github-actions-all-actions-will-run-on-node16-instead-of-node12-by-default/